program: Gaussian 09
title: 000278137
version: EM64L-G09RevD.01
frameworkgroup: C1[X(C16H35O3P)]
method: RPBEPBE
basis: SDD
operation: Freq
keyword: #p
keyword: freq=noraman
keyword: PBEPBE/SDD
title: #p freq=noraman PBEPBE/SDD
converged: YES YES NO NO
title: Mulliken charges:
elementType: P O O O C C C C C C C C C C C C C C C C H H H H H H H H H H H H H H H H H H H H H H H H H H H H H H H H H H H
charge: 1.290723 -0.494968 -0.530798 -0.624844 -0.386838 -0.386266 -0.384855 -0.386147 -0.387203 -0.384803 -0.361828 -0.382157 -0.313989 -0.372802 -0.805347 -0.353382 -0.356772 -0.696615 -0.497294 -0.483300 0.195856 0.194758 0.193508 0.193656 0.193407 0.194623 0.194206 0.193943 0.200455 0.196623 0.192613 0.193047 0.191150 0.197041 0.192124 0.192130 0.232526 0.217966 0.189369 0.189031 0.289634 0.261719 0.187682 0.187756 0.194730 0.194560 0.209651 0.209763 0.214885 0.245669 0.238746 0.211895 0.235047 0.225440 0.254276
chargesum: 0.00000
title: Mulliken charges with hydrogens summed into heavy atoms:
elementType: P O O O C C C C C C C C C C C C C C C C
charge: 1.290723 -0.494968 -0.530798 -0.624844 0.003776 0.000898 0.003175 0.002002 0.009875 0.000857 0.026362 0.002097 0.136503 0.005598 -0.253994 0.022056 0.032519 -0.062316 0.199017 0.231463
polarizability: 2.80607718e+02 2.56686233e+00 1.79006443e+02 2.67485418e+00 -2.13547109e+00 1.75609267e+02
1716.lowfreq: -30.3859 -11.9916 -4.5524 -1.6294 -0.0015 0.0011 0.0016 10.8373 15.6022
frequency: -22.3083 2.7355 15.4420 21.3900 41.9090 42.8366 45.2109 50.8652 64.2684 68.6848 74.7340 77.9180 84.4004 103.8325 108.1605 111.5355 125.7510 128.6266 132.1209 138.8392 148.8752 153.3910 175.2059 184.9223 207.1595 225.7699 235.8472 242.7870 269.4672 315.4984 339.5408 348.0001 372.8500 418.6756 432.2175 461.5037 493.1343 500.8965 578.8817 652.0790 718.5325 720.7121 723.6857 730.7161 738.5804 743.7360 761.5811 787.3040 822.3538 864.4369 886.9074 909.6631 954.4736 964.6571 971.2962 974.7622 983.1853 995.7299 1000.5594 1019.6244 1028.0108 1035.2951 1042.9575 1050.6130 1066.9129 1076.6927 1078.5980 1081.1667 1082.0125 1087.9358 1098.7575 1109.4536 1114.7261 1122.9776 1126.9860 1134.7966 1180.0473 1193.6699 1197.6544 1215.7880 1222.4367 1237.9793 1244.8155 1258.8105 1265.2090 1276.5180 1277.4546 1283.4572 1285.4239 1289.1027 1291.4987 1296.7355 1298.1045 1301.0852 1306.2653 1325.5562 1341.4696 1350.9734 1352.3865 1354.3925 1356.0594 1358.6057 1388.0624 1420.2345 1425.0871 1430.7477 1457.7440 1458.0516 1460.1191 1461.0685 1461.3524 1463.5053 1464.7126 1465.4076 1468.6172 1471.2536 1473.2973 1476.0925 1476.2842 1477.6441 1481.6786 1485.6420 1488.3446 1489.5322 2948.2933 2948.5232 2949.6276 2950.5617 2951.5825 2953.5323 2954.6682 2958.3085 2962.3557 2963.1484 2965.2953 2968.7128 2971.7918 2981.1085 2981.2910 2983.4991 2986.5714 2987.0704 2991.3684 2996.6584 3003.0024 3011.9722 3021.0411 3022.1580 3029.5800 3036.9210 3042.8099 3048.8662 3059.0595 3068.3686 3070.4049 3081.3196 3090.4942 3115.6868 3120.7868
redmass: 1.8190 3.7316 4.3441 3.7107 3.4688 4.0581 1.5717 1.1318 2.8400 2.8529 1.5971 4.0311 2.3247 1.7001 2.3784 5.5483 2.5822 2.0366 1.6670 2.0084 1.9067 2.1053 3.7334 3.6689 4.0370 1.1297 3.9376 3.7252 3.6319 7.0929 3.9813 3.5297 5.0855 3.3668 3.7668 4.4237 3.1523 3.0913 6.8941 9.8536 1.0602 1.0638 1.0740 1.0903 3.4673 1.2281 1.1777 1.2091 1.2405 1.2565 1.9054 1.2544 1.2549 8.8445 9.5751 5.8002 4.5862 1.3614 3.2560 3.6288 1.4710 2.2965 2.3750 3.3579 2.8687 2.5675 2.1629 2.2728 2.1891 2.7318 1.5537 1.2485 1.2715 2.9261 1.3002 1.3355 1.9282 1.5107 1.3637 1.4867 1.3030 1.3785 1.2965 1.3001 1.2912 1.2137 1.0242 1.0349 1.2909 1.1148 1.1083 1.0806 1.1315 1.1024 1.3237 1.3698 1.4311 1.6214 1.6074 1.6730 1.6124 1.5168 1.2169 1.1003 1.1193 1.0973 1.0731 1.0732 1.0518 1.0691 1.0710 1.0645 1.0624 1.0682 1.0794 1.0602 1.0779 1.0569 1.0428 1.0815 1.0886 1.0922 1.0948 1.0949 1.0584 1.0583 1.0586 1.0588 1.0592 1.0590 1.0594 1.0593 1.0589 1.0330 1.0584 1.0586 1.0365 1.0297 1.0960 1.0966 1.0784 1.0792 1.0987 1.1005 1.1025 1.1040 1.1022 1.0603 1.1049 1.1048 1.1045 1.1041 1.1012 1.1007 1.0992 1.1052 1.1040 1.1018 1.1035
irintensity: 0.5581 0.3002 0.2097 0.3466 0.7751 0.5560 0.1095 0.4941 4.1353 1.6769 0.1164 0.5371 2.5428 0.0614 0.1768 2.9717 0.8458 0.3818 0.2957 0.7602 0.0120 0.0430 10.6616 6.8986 11.0290 0.0006 1.0191 2.6093 2.5031 24.0632 2.3224 1.6061 3.1752 4.5423 10.9597 18.8850 2.3577 0.4285 53.3439 142.4200 14.8604 4.2329 8.9595 0.1930 39.7178 18.9762 5.4593 8.5231 1.4286 3.4835 4.9146 0.5480 1.9641 205.7634 129.9848 28.8069 1.4893 1.2760 2.1191 6.9360 7.2810 3.8874 35.8387 3.5514 0.6804 0.2532 0.2261 0.4562 0.0016 2.2112 55.1047 0.9697 5.8478 14.5956 0.8546 0.7577 0.9173 12.7930 24.1133 1.1570 1.9625 0.9875 5.0299 0.5329 1.9976 0.7350 0.0461 0.0799 1.2981 0.0324 0.2293 0.2787 0.1252 0.2539 0.4737 0.2409 0.2375 0.4527 0.1382 0.3384 0.1337 0.2743 11.2717 2.7411 2.0028 9.7357 0.0161 0.0422 13.9281 0.1088 0.3679 0.8329 5.4803 2.6537 0.9128 11.5118 2.5699 8.2509 12.1851 0.3123 1.3218 1.0974 12.1420 40.7991 0.0635 0.0039 0.1762 0.1548 0.0105 4.9214 0.0744 0.9178 4.5981 50.7416 175.0260 208.1955 37.5404 62.7057 0.2004 0.1099 10.9813 13.4833 0.9157 0.7733 0.3078 0.9154 0.9308 11.5056 9.2757 0.3561 238.7383 138.8852 45.9872 99.3213 55.7207 27.7911 15.1432 16.2817 17.2804
temp: 298.150 k
press: 1.00000 atm
elementType: 15 8 8 8 6 6 6 6 6 6 6 6 6 6 6 6 6 6 6 6 1 1 1 1 1 1 1 1 1 1 1 1 1 1 1 1 1 1 1 1 1 1 1 1 1 1 1 1 1 1 1 1 1 1 1
symmnumber: 1
zpe: 1276946.4 jmol-1
zpe.correction: 0.486363 hartree
zpe.thermalcorrener: 0.514387 hartree
zpe.thermalcorrenthalpy: 0.515331 hartree
zpe.thermalcorrgfe: 0.420335 hartree
zpe.sumelectzpe: -1195.893323 hartree
zpe.sumelectthermal: -1195.865299 hartree
zpe.sumelectthermalent: -1195.864354 hartree
zpe.sumelectthermalfe: -1195.959351 hartree
dipole: 1.1278 1.7918 -3.8506
dipole: 4.3943
quadrupole: -137.9726 -130.7609 -145.6028
quadrupole: -11.6500 25.1225 1.0316
quadrupole: 0.1395 7.3512 -7.4907 -11.6500 25.1225 1.0316
hfenergy: -1196.3796857 hartree
pointgroup: C01 [X(C16H35O3P1)]
dipole: -0.4498631 -0.1534723 -1.6622132 debye
polarizability: 280.4714789|4.8211604|177.3625455|-2.1960339|2.6799794|177.3894042 unknown
InChI: InChI=1S/C16H35O3P/c1-4-5-6-7-8-9-10-11-12-13-14-15-16-20(17,18-2)19-3/h4-16H2,1-3H3
charge 0 multiplicity 1
55 atoms
P  6.721719 0.267406 0.369602
O  6.849398 -1.473948 0.236097
O  7.879816 0.891352 -0.780609
O  6.941487 0.722817 1.87588
C  -1.2639 -0.025381 0.296158
C  -2.576579 0.307056 -0.448538
C  0.001782 0.442559 -0.457106
C  -3.84475 -0.116602 0.326465
C  1.315568 0.072864 0.267732
C  -5.156661 0.19191 -0.429775
C  2.576518 0.593363 -0.458775
C  -6.426145 -0.200943 0.359224
C  3.887738 0.172894 0.244044
C  -7.73767 0.094423 -0.403148
C  5.128107 0.740934 -0.477713
C  -9.008115 -0.279449 0.393508
C  -10.319372 0.010906 -0.37211
C  -11.583575 -0.35592 0.4352
C  6.926147 -2.094195 -1.100917
C  9.257332 1.15382 -0.305083
H  -1.284362 0.443498 1.302134
H  -1.206898 -1.121058 0.465758
H  -2.618278 1.398541 -0.648001
H  -2.570228 -0.189768 -1.441393
H  0.007666 -0.000483 -1.475149
H  -0.043289 1.542982 -0.597352
H  -3.859886 0.396937 1.3106
H  -3.795429 -1.204047 0.544971
H  1.293639 0.480902 1.299418
H  1.378715 -1.030427 0.371035
H  -5.195482 1.275679 -0.66826
H  -5.15137 -0.340027 -1.404275
H  2.579258 0.218053 -1.503733
H  2.529824 1.70029 -0.523818
H  -6.436243 0.340418 1.328443
H  -6.383326 -1.282054 0.608548
H  3.878152 0.527524 1.293242
H  3.947751 -0.932781 0.28649
H  -7.733584 -0.457697 -1.366422
H  -7.774114 1.173098 -0.664215
H  5.109944 1.845258 -0.494053
H  5.19396 0.388601 -1.522746
H  -9.015883 0.276828 1.354348
H  -8.971886 -1.356884 0.659532
H  -10.313992 -0.550325 -1.328917
H  -10.351477 1.086106 -0.643347
H  -11.590553 -1.431988 0.69307
H  -11.627765 0.214934 1.382016
H  -12.506502 -0.138862 -0.133696
H  7.151954 -3.154711 -0.911666
H  7.727549 -1.638067 -1.71053
H  5.960987 -2.01596 -1.639776
H  9.679401 1.876745 -1.019651
H  9.852097 0.222535 -0.310261
H  9.243202 1.581549 0.713617
