program: Gaussian 09
title: 000278126
version: EM64L-G09RevD.01
frameworkgroup: C1[X(C13H16O2)]
method: RPBEPBE
basis: SDD
operation: Freq
keyword: #pfreq=noraman
keyword: PBEPBE/SDD
title: #p freq=noraman PBEPBE/SDD
converged: YES YES NO NO
title: Mulliken charges:
elementType: O O C C C C C C C C C C C C C H H H H H H H H H H H H H H H H
charge: -0.295076 -0.281873 -0.545294 -0.451718 0.319631 -0.459640 -0.377163 0.069429 0.192593 0.210883 -0.391134 -0.395758 -0.211883 -0.515953 -0.538127 0.250349 0.213845 0.213484 0.213856 0.220034 0.210334 0.260516 0.251118 0.238437 0.224438 0.220839 0.228638 0.241461 0.219203 0.223711 0.240821
chargesum: 0.00000
title: Mulliken charges with hydrogens summed into heavy atoms:
elementType: O O C C C C C C C C C C C C C
charge: -0.295076 -0.281873 -0.081100 -0.024378 0.319631 -0.029273 -0.116647 0.069429 0.192593 0.210883 -0.140016 -0.157321 0.012555 0.174985 0.145608
polarizability: 1.88520671e+02 -1.92420107e-01 1.60940126e+02 5.22092395e+00 3.31507922e+00 9.54082281e+01
1716.lowfreq: -64.2336 -17.5890 -12.0703 -4.8915 -0.0003 0.0003 0.0005 32.6774 57.9797
frequency: -63.9283 32.2577 57.9473 80.9599 94.2568 105.8615 142.3328 164.4433 192.0305 199.7475 250.9231 265.5364 286.0769 314.5414 366.6618 403.5557 459.7912 490.5984 536.1070 561.1618 590.3007 615.6266 637.7091 712.0480 724.2549 784.9240 806.3818 822.4324 843.7439 857.3076 860.1958 892.4372 909.1825 953.2387 957.2795 966.6487 981.4756 1040.0802 1051.7152 1054.3064 1082.6816 1104.7792 1108.9031 1121.2593 1144.2529 1149.4474 1171.2520 1180.0374 1195.0640 1215.6159 1240.0408 1249.7630 1255.2857 1288.4279 1290.8306 1319.6417 1364.9946 1416.6368 1431.9924 1449.0380 1450.4002 1454.1533 1462.0780 1464.5434 1465.9097 1467.3440 1475.9331 1480.6613 1575.7709 1595.5213 1639.1360 2958.1373 2960.5191 2973.0351 2988.0582 2998.8303 3019.2437 3040.8239 3046.1504 3070.5178 3078.1080 3090.7475 3119.6945 3137.4726 3152.3539 3165.6760 3177.3088
redmass: 1.1083 2.5551 3.6223 3.2868 3.5871 2.8173 2.0152 3.0807 2.3273 3.3053 1.9922 2.1176 3.5724 3.5139 5.0659 4.6278 3.5519 4.6296 4.8662 3.6575 3.2119 4.3592 2.5798 6.2020 1.7266 2.2998 2.4213 1.7238 2.4677 2.7347 1.7044 1.5785 2.6284 1.3879 2.0287 5.0051 4.3993 2.5288 2.3848 2.0134 1.7323 1.2251 1.2602 1.1998 1.4183 1.3284 1.4842 1.1918 1.2789 2.0080 4.9315 1.8966 1.4608 1.5360 1.7572 1.7623 9.0173 1.4995 1.3101 1.4074 1.2879 1.7801 1.0803 1.0563 1.1118 1.1067 1.1330 1.1036 6.8783 7.0864 7.1726 1.0329 1.0635 1.0288 1.0619 1.0694 1.0901 1.0996 1.1039 1.1030 1.1039 1.1046 1.0994 1.0870 1.0956 1.0916 1.0981
irintensity: 0.1580 1.7338 0.1703 5.3067 2.2986 7.4118 1.3703 1.3493 0.2813 1.3753 0.8908 1.2870 1.6507 3.3548 1.5929 7.5210 1.3524 4.2447 0.8087 12.4827 1.7609 2.4204 3.1942 0.7358 48.7833 39.1024 2.9097 17.3873 5.9533 9.0494 6.9579 2.7070 5.7647 4.9484 6.5588 12.8566 3.5069 80.5976 117.2573 7.3154 23.2134 3.0544 0.0894 1.9320 7.3457 1.0304 1.3834 4.9169 10.5901 122.0275 39.3036 9.7574 5.0144 3.7176 4.7654 10.2805 3.8999 70.3182 4.5277 48.9233 28.6366 37.4677 3.9568 10.5378 10.6669 13.3350 15.6229 7.8263 93.5497 29.4398 4.2147 79.3945 57.3978 62.3085 23.3861 43.1295 52.1414 10.7954 46.0970 63.5828 31.8544 36.4114 22.4640 8.1952 8.1283 12.9935 14.2855
temp: 298.150 k
press: 1.00000 atm
elementType: 8 8 6 6 6 6 6 6 6 6 6 6 6 6 6 1 1 1 1 1 1 1 1 1 1 1 1 1 1 1 1
symmnumber: 1
zpe: 672027.1 jmol-1
zpe.correction: 0.255962 hartree
zpe.thermalcorrener: 0.270272 hartree
zpe.thermalcorrenthalpy: 0.271216 hartree
zpe.thermalcorrgfe: 0.214141 hartree
zpe.sumelectzpe: -654.257787 hartree
zpe.sumelectthermal: -654.243476 hartree
zpe.sumelectthermalent: -654.242532 hartree
zpe.sumelectthermalfe: -654.299607 hartree
dipole: -0.4278 -1.8453 -1.2207
dipole: 2.2534
quadrupole: -76.8075 -83.4896 -90.8719
quadrupole: 6.6913 -0.9685 -2.7494
quadrupole: 6.9155 0.2334 -7.1489 6.6913 -0.9685 -2.7494
hfenergy: -654.5137483 hartree
pointgroup: C01 [X(C13H16O2)]
dipole: 0.1115407 0.7562866 -0.4489839 debye
polarizability: 188.4472781|3.1502121|161.4351127|0.6731969|-1.4457|94.9866336 unknown
InChI: InChI=1S/C13H16O2/c1-14-11-8-5-9-12(15-2)13(11)10-6-3-4-7-10/h5-6,8-9H,3-4,7H2,1-2H3
charge 0 multiplicity 1
31 atoms
O  -0.016611 -2.647994 -0.013461
O  0.89078 2.169231 0.012902
C  -1.729622 1.161551 -0.969445
C  -3.255744 0.933512 -0.742916
C  -1.07089 0.186404 0.013207
C  -3.37071 0.310931 0.68521
C  -1.986261 -0.275688 0.913694
C  0.37307 -0.171904 0.003105
C  0.832878 -1.522668 0.041631
C  1.379741 0.84812 0.039795
C  2.208297 -1.839412 0.17284
C  2.756438 0.544089 0.146144
C  3.160302 -0.808107 0.229867
C  -1.064425 -2.708972 -1.047597
C  1.863817 3.257847 0.112364
H  -1.421634 2.196065 -0.731057
H  -1.423324 0.974374 -2.016535
H  -3.638479 0.209621 -1.487071
H  -3.843092 1.862386 -0.849909
H  -3.594553 1.082923 1.451351
H  -4.17738 -0.444093 0.755779
H  -1.751154 -0.954466 1.740439
H  2.494147 -2.894287 0.205995
H  3.5076 1.337428 0.179816
H  4.224392 -1.051105 0.322361
H  -0.853466 -2.007533 -1.87589
H  -1.054273 -3.747184 -1.420745
H  -2.050279 -2.468562 -0.614477
H  2.569791 3.250354 -0.740956
H  2.430597 3.20635 1.062344
H  1.26425 4.180087 0.088216
