program: Gaussian 09
title: 000278119
version: EM64L-G09RevD.01
frameworkgroup: C1[X(C14H18O)]
method: RPBEPBE
basis: SDD
operation: Freq
keyword: #pfreq=noraman
keyword: PBEPBE/SDD
title: #p freq=noraman PBEPBE/SDD
converged: YES YES NO NO
title: Mulliken charges:
elementType: O C C C C C C C C C C C C C C H H H H H H H H H H H H H H H H H H
charge: -0.275588 -0.387102 -0.382465 -0.380954 -0.574172 -0.459979 0.363038 -0.358869 0.352775 -0.548608 -0.428036 0.334191 -0.220441 -0.387401 -0.537367 0.208004 0.198474 0.183079 0.201464 0.227781 0.204555 0.197404 0.207634 0.199690 0.198758 0.227481 0.255495 0.239093 0.219150 0.241016 0.219307 0.219800 0.242794
chargesum: 0.00000
title: Mulliken charges with hydrogens summed into heavy atoms:
elementType: O C C C C C C C C C C C C C C
charge: -0.275588 0.019376 0.002077 0.024084 -0.141836 -0.061531 0.363038 -0.131388 0.352775 -0.293114 -0.188942 0.334191 -0.001291 -0.146386 0.144534
polarizability: 2.26760438e+02 -9.74801627e+00 1.53980190e+02 -3.97409907e-01 -2.10408930e+00 9.43415603e+01
1716.lowfreq: -3.1468 0.0006 0.0008 0.0008 5.0007 11.9659 46.5954 51.4925 81.6893
frequency: 46.5109 51.4752 81.6865 109.2929 167.9244 193.3490 204.6371 222.6979 255.5376 266.4560 291.8749 314.4478 331.4428 358.9110 432.9931 454.4727 471.4018 487.4412 537.7862 563.1970 617.8576 645.3650 694.4560 701.0318 753.0856 781.4986 809.7380 822.8332 846.0951 857.6749 874.1566 885.3339 895.2309 930.9922 963.2739 964.7267 974.5389 983.6051 1017.9459 1049.2744 1068.8190 1083.4939 1096.3399 1111.7414 1125.2875 1133.5747 1154.7869 1176.6055 1187.9431 1206.4208 1213.3926 1257.4645 1262.1688 1285.5566 1295.3795 1310.8645 1320.7110 1333.2509 1352.7449 1355.7170 1362.2399 1387.8291 1424.2304 1439.1993 1458.3436 1461.5119 1465.5190 1465.7316 1467.8451 1474.2742 1477.3639 1484.6132 1577.5797 1614.9738 1648.4644 2943.4271 2952.6062 2956.3748 2958.0105 2969.6468 2970.3422 3012.2219 3026.4664 3031.9457 3035.8085 3042.5225 3044.4331 3106.4862 3121.8387 3127.1156 3152.6612 3156.6236 3167.9906
redmass: 3.4916 3.5255 3.5036 3.5580 2.8043 2.4332 1.7166 2.7346 3.4177 1.8435 3.3304 3.3205 1.8007 3.2665 3.3517 2.4772 3.7823 1.8057 4.0079 3.7573 3.5976 3.5617 2.6091 2.1008 3.2295 1.5476 1.8451 2.3924 1.6404 1.6788 1.4327 1.8126 1.9380 2.5283 2.2389 1.3703 2.4244 4.2978 3.1114 1.9752 2.0360 1.9692 1.6493 1.2602 2.0768 1.4737 1.3532 1.3546 1.1697 1.5388 1.3228 1.2128 1.4886 1.7165 1.4493 1.2704 1.3303 1.4086 1.4114 1.4985 1.7237 6.7588 2.1837 1.3896 1.0907 1.0920 1.1115 1.0506 1.1232 1.0694 1.6694 1.3131 5.6204 6.6089 7.1321 1.0666 1.0613 1.0331 1.0676 1.0604 1.0636 1.0967 1.1021 1.0935 1.1019 1.1038 1.0928 1.0905 1.0990 1.0866 1.0920 1.0912 1.0969
irintensity: 0.0419 1.9532 5.4184 1.3977 0.4052 0.6071 0.3916 1.4559 1.1832 0.6680 0.8643 0.0294 0.9074 1.4847 1.8560 0.9154 1.7525 1.7209 6.6194 3.0778 3.5515 1.3273 9.8101 17.7619 5.1916 56.8185 8.5407 4.8118 14.2947 22.7437 0.6318 14.1234 6.7690 1.4292 18.6471 1.0149 20.8592 1.9286 50.3270 1.8376 0.3579 0.5783 8.8642 0.2148 0.4842 7.2530 0.0994 64.0201 5.2782 70.8273 2.8949 1.0177 30.1451 28.1410 2.6310 2.7245 0.7980 1.4875 6.3196 0.7130 19.4828 6.8260 31.8862 2.7566 5.6776 6.8935 12.2714 11.3490 1.6941 22.7235 53.8475 24.1284 75.2800 107.8094 2.4407 46.8998 30.3160 74.6997 18.1873 52.7067 32.6377 81.5667 24.7771 59.3793 100.8064 52.3958 23.1514 27.8664 28.2147 7.0732 17.5878 5.0185 15.3464
temp: 298.150 k
press: 1.00000 atm
elementType: 8 6 6 6 6 6 6 6 6 6 6 6 6 6 6 1 1 1 1 1 1 1 1 1 1 1 1 1 1 1 1 1 1
symmnumber: 1
zpe: 743064.9 jmol-1
zpe.correction: 0.283018 hartree
zpe.thermalcorrener: 0.297018 hartree
zpe.thermalcorrenthalpy: 0.297962 hartree
zpe.thermalcorrgfe: 0.242231 hartree
zpe.sumelectzpe: -618.360089 hartree
zpe.sumelectthermal: -618.346089 hartree
zpe.sumelectthermalent: -618.345145 hartree
zpe.sumelectthermalfe: -618.400877 hartree
dipole: 0.8260 0.2750 -0.1324
dipole: 0.8806
quadrupole: -70.1734 -87.7393 -93.7824
quadrupole: 0.2708 -1.9062 -0.7524
quadrupole: 13.7250 -3.8409 -9.8840 0.2708 -1.9062 -0.7524
hfenergy: -618.6431074 hartree
pointgroup: C01 [X(C14H18O1)]
dipole: -0.3303044 0.0687 0.078751 debye
polarizability: 225.7971261|10.1765502|142.6863669|7.969106|24.378087|106.5986962 unknown
InChI: InChI=1S/C14H18O/c1-15-14-10-6-9-13(11-14)12-7-4-2-3-5-8-12/h6-7,9-11H,2-5,8H2,1H3
charge 0 multiplicity 1
33 atoms
O  -3.31069 -1.539742 -0.605794
C  2.529952 -1.550101 -0.807149
C  3.965389 -1.213104 -0.33439
C  4.065401 -0.308489 0.917407
C  1.69956 -0.316407 -1.264258
C  3.459506 1.113448 0.728827
C  1.11783 0.523084 -0.125379
C  1.942104 1.155397 0.766047
C  -0.36811 0.620119 0.010225
C  -1.203051 -0.46309 -0.359966
C  -0.988277 1.801891 0.519442
C  -2.608639 -0.385754 -0.2113
C  -2.38577 1.871886 0.663417
C  -3.217326 0.783571 0.304541
C  -4.76745 -1.521749 -0.468187
H  1.985404 -2.081012 -0.001089
H  2.607413 -2.255932 -1.658722
H  4.504783 -0.71926 -1.170885
H  4.505615 -2.160298 -0.132641
H  0.887055 -0.648989 -1.934413
H  2.357978 0.328901 -1.884806
H  5.136662 -0.201422 1.183084
H  3.570652 -0.800759 1.777956
H  3.830477 1.519152 -0.238242
H  3.855456 1.778768 1.518552
H  1.488675 1.703893 1.603033
H  -0.784751 -1.399218 -0.742871
H  -0.370788 2.671743 0.765081
H  -2.845651 2.790574 1.04567
H  -4.302171 0.862593 0.419353
H  -5.222582 -0.726422 -1.090707
H  -5.072132 -1.38329 0.58789
H  -5.102622 -2.507284 -0.823923
