program: Gaussian 09
title: 000278131
version: EM64L-G09RevD.01
frameworkgroup: C1[X(C14H18O2)]
method: RPBEPBE
basis: SDD
operation: Freq
keyword: #pfreq=noraman
keyword: PBEPBE/SDD
title: #p freq=noraman PBEPBE/SDD
converged: YES YES NO NO
title: Mulliken charges:
elementType: O O C C C C C C C C C C C C C C H H H H H H H H H H H H H H H H H H
charge: -0.302005 -0.266207 -0.418404 -0.506102 -0.406389 0.274561 -0.433980 -0.381154 0.199547 0.179696 -0.374268 -0.504424 -0.391813 0.351997 -0.532139 -0.536942 0.201590 0.204359 0.225858 0.240703 0.199266 0.205863 0.211240 0.208232 0.224277 0.246097 0.271559 0.238632 0.234046 0.221386 0.230729 0.244216 0.219489 0.220482
chargesum: 0.00000
title: Mulliken charges with hydrogens summed into heavy atoms:
elementType: O O C C C C C C C C C C C C C C
charge: -0.302005 -0.266207 -0.012454 -0.039541 -0.001260 0.274561 -0.014507 -0.156877 0.199547 0.179696 -0.128172 -0.232865 -0.153180 0.351997 0.154022 0.147246
polarizability: 2.30271342e+02 -7.71084943e-01 1.49915354e+02 8.40048962e+00 7.43062791e+00 1.06805536e+02
1716.lowfreq: -11.9226 -7.7654 -0.0008 -0.0008 -0.0006 5.2117 42.7739 50.2893 77.7728
frequency: 42.5922 50.2795 77.7346 85.5602 90.2968 138.5479 151.7597 159.5658 198.0258 210.4940 242.2909 257.4080 259.0477 296.0301 320.8198 354.8605 396.3503 438.1579 462.5530 482.7384 528.6458 536.9548 579.7898 594.6023 638.4864 700.5074 725.4747 747.7568 797.8399 804.4776 832.5056 846.8995 861.1245 883.4202 916.4664 921.5914 928.4868 940.3326 967.4488 989.6511 1009.5501 1071.5229 1076.1480 1096.9782 1106.7115 1112.1107 1113.7779 1130.3475 1138.6254 1152.8845 1168.3623 1170.8466 1208.0183 1235.8173 1249.7601 1258.1958 1274.7082 1302.8945 1332.9358 1336.1829 1340.3333 1351.7405 1364.3914 1410.2797 1433.2410 1442.1158 1452.6437 1457.4928 1459.2446 1466.1698 1466.8821 1471.8900 1472.9905 1477.9638 1483.7805 1560.6409 1617.0183 1657.4915 2944.7165 2957.2176 2957.7741 2974.0903 2975.6650 2983.7905 2999.9465 3025.5563 3036.6645 3044.6132 3045.4746 3046.4643 3091.9930 3112.0150 3123.1792 3134.5235 3165.6012 3177.2999
redmass: 3.3050 3.3674 2.8914 3.2276 3.2923 2.4337 2.6541 1.2303 2.3175 2.6547 1.6983 2.3230 3.8759 2.4720 3.3715 3.4672 4.6942 2.4724 3.3829 4.1693 3.1818 4.7058 3.6328 3.7661 3.7833 6.0166 2.6900 3.0851 1.3122 1.4190 3.7237 1.5422 4.3499 1.6202 1.4253 1.9956 2.9488 1.5375 7.4359 3.6078 3.0478 1.7753 1.8592 1.8382 1.5887 1.2608 1.3592 1.2265 1.4521 1.3975 1.4958 1.4949 1.9711 1.3058 1.7618 2.0630 1.5345 1.2969 1.4123 1.7822 1.7287 2.2326 2.5937 2.5785 1.2237 1.3813 1.1099 1.0670 1.0665 1.0505 1.0861 1.0866 1.1415 1.0645 2.4212 7.6474 7.0340 6.6908 1.0644 1.0316 1.0328 1.0658 1.0605 1.0630 1.0908 1.0978 1.0991 1.1038 1.1040 1.1037 1.0903 1.1009 1.0992 1.0884 1.0944 1.0924
irintensity: 1.4765 0.1517 2.0174 7.3983 4.8761 0.4338 1.9494 0.7783 1.3677 1.9704 1.7944 1.1389 2.7372 3.9229 1.9192 5.7821 2.5936 2.2509 5.9086 2.7680 3.7828 3.3584 16.9573 12.7848 3.8757 3.7850 4.2006 0.8327 32.0752 21.7724 1.3444 5.5473 6.4616 32.3903 4.7332 7.9517 1.8010 0.1857 19.7618 16.2044 66.1847 12.2137 1.4978 66.5896 71.8336 0.5095 16.4240 31.1169 14.1803 28.9686 27.2727 21.7190 25.9672 4.2782 22.6421 63.0970 1.7969 6.5965 1.5115 11.1710 10.5466 12.1414 28.6248 3.6371 14.7063 3.1167 1.1980 6.3721 23.9535 13.1119 12.8444 16.0642 83.1750 1.8448 65.5995 34.6176 153.5682 4.5605 46.8143 94.1432 44.3328 29.2304 31.3441 22.5952 57.2908 19.4581 75.1193 47.5786 74.2169 38.1554 24.8501 27.4009 28.7939 6.7748 14.0311 0.8422
temp: 298.150 k
press: 1.00000 atm
elementType: 8 8 6 6 6 6 6 6 6 6 6 6 6 6 6 6 1 1 1 1 1 1 1 1 1 1 1 1 1 1 1 1 1 1
symmnumber: 1
zpe: 748783.6 jmol-1
zpe.correction: 0.285197 hartree
zpe.thermalcorrener: 0.301118 hartree
zpe.thermalcorrenthalpy: 0.302062 hartree
zpe.thermalcorrgfe: 0.241735 hartree
zpe.sumelectzpe: -693.488622 hartree
zpe.sumelectthermal: -693.472700 hartree
zpe.sumelectthermalent: -693.471756 hartree
zpe.sumelectthermalfe: -693.532084 hartree
dipole: -0.1653 -1.9613 -1.4786
dipole: 2.4617
quadrupole: -82.2141 -90.6854 -96.8724
quadrupole: -9.3917 0.0360 -3.2188
quadrupole: 7.7099 -0.7614 -6.9484 -9.3917 0.0360 -3.2188
hfenergy: -693.7738183 hartree
pointgroup: C01 [X(C14H18O2)]
dipole: -0.0727545 -0.4228771 -0.8682816 debye
polarizability: 229.6476792|-8.213098|135.5928011|8.9602063|21.4154961|121.7517519 unknown
InChI: InChI=1S/C14H18O2/c1-15-12-8-9-13(14(10-12)16-2)11-6-4-3-5-7-11/h6,8-10H,3-5,7H2,1-2H3
charge 0 multiplicity 1
34 atoms
O  0.062665 1.897779 1.189315
O  4.283909 -0.148383 0.250715
C  -3.6675 -0.720946 1.055058
C  -2.231371 -0.157453 1.151866
C  -4.371856 -0.213124 -0.222664
C  -1.463271 -0.297074 -0.165641
C  -3.615594 -0.700112 -1.481196
C  -2.111009 -0.559338 -1.340997
C  0.030693 -0.220974 -0.118481
C  0.741363 0.816809 0.56308
C  0.817646 -1.242548 -0.710385
C  2.14304 0.809481 0.66819
C  2.227786 -1.267234 -0.629312
C  2.89242 -0.236359 0.078981
C  -0.554081 2.85326 0.249341
C  5.103963 -1.198222 -0.356536
H  -3.630872 -1.828808 1.030116
H  -4.242788 -0.436229 1.956785
H  -1.668451 -0.677303 1.950992
H  -2.258264 0.90541 1.462132
H  -4.390885 0.895324 -0.208935
H  -5.423914 -0.554935 -0.254515
H  -3.958914 -0.141577 -2.375628
H  -3.865913 -1.764953 -1.681128
H  -1.516817 -0.665579 -2.260709
H  0.298904 -2.063378 -1.218276
H  2.652798 1.617651 1.199239
H  2.780323 -2.089418 -1.093057
H  -1.293618 2.355669 -0.407209
H  0.22405 3.336401 -0.373443
H  -1.052096 3.608357 0.877169
H  6.142022 -0.931238 -0.10937
H  4.97724 -1.224103 -1.456678
H  4.86439 -2.193354 0.066783
