program: Gaussian 09
title: 000278115
version: EM64L-G09RevD.01
frameworkgroup: C1[X(C14H18O2)]
method: RPBEPBE
basis: SDD
operation: Freq
keyword: #pfreq=noraman
keyword: PBEPBE/SDD
title: #p freq=noraman PBEPBE/SDD
converged: YES YES NO NO
title: Mulliken charges:
elementType: O O C C C C C C C C C C C C C C H H H H H H H H H H H H H H H H H H
charge: -0.299536 -0.270128 -0.419106 -0.505723 -0.406738 0.273239 -0.434689 -0.374895 0.241581 0.120807 -0.531048 0.327734 -0.347975 -0.356674 -0.530818 -0.537127 0.202718 0.204345 0.225700 0.243387 0.199182 0.205971 0.211928 0.210089 0.228162 0.272212 0.244478 0.241823 0.231764 0.218742 0.229432 0.243114 0.219539 0.218507
chargesum: 0.00000
title: Mulliken charges with hydrogens summed into heavy atoms:
elementType: O O C C C C C C C C C C C C C C
charge: -0.299536 -0.270128 -0.012043 -0.036635 -0.001585 0.273239 -0.012671 -0.146733 0.241581 0.120807 -0.258837 0.327734 -0.103497 -0.114851 0.149121 0.144034
polarizability: 2.16067014e+02 5.02007447e-01 1.58970202e+02 7.06410190e+00 8.46915209e+00 1.06784934e+02
1716.lowfreq: -0.0005 0.0006 0.0007 4.9163 5.1991 12.4804 50.3021 59.0021 71.7172
frequency: 50.1152 58.9448 71.6928 87.1435 88.5263 128.2422 143.4596 164.1157 211.8922 218.1895 246.9351 249.2253 262.8653 294.1566 312.5705 377.0960 422.0031 426.1422 453.1970 470.0547 522.8371 530.4340 569.1194 616.1646 658.7123 688.6251 725.8706 748.2507 801.6993 807.9831 813.9625 844.9784 861.7022 887.8818 920.2572 928.7906 934.3226 943.0135 955.8443 992.1416 1014.4417 1072.6946 1078.0069 1099.2224 1110.7340 1112.5865 1113.4869 1133.7440 1148.3638 1153.1808 1169.6826 1178.3562 1190.3708 1233.1807 1241.3008 1257.0814 1276.9738 1306.2268 1333.5890 1335.4734 1343.8399 1356.8177 1366.3353 1411.0529 1431.6066 1437.3864 1452.6050 1457.6350 1458.8847 1465.9181 1468.9443 1472.3594 1473.4321 1476.0683 1479.0578 1567.9231 1615.5869 1660.1858 2946.3229 2953.1930 2955.0502 2974.5770 2976.0062 2985.9943 3001.8272 3025.9857 3037.6129 3040.6669 3041.1728 3047.1018 3097.0959 3108.4154 3121.9972 3146.8841 3158.8263 3169.1402
redmass: 3.0424 3.1878 2.8248 3.1356 3.6602 3.9637 2.3834 1.1248 1.8494 2.9804 1.9884 3.5418 2.1755 3.3221 2.1974 6.0847 2.9779 4.0416 4.3297 2.7171 3.3927 3.5721 3.6286 3.3416 4.7719 5.0254 2.7564 3.2428 1.4590 1.8298 2.5510 1.7186 2.4189 1.5901 1.3766 2.0378 1.6085 3.1085 6.0450 4.6473 2.8629 1.7707 1.8542 1.5476 1.5120 1.2606 1.2852 1.1760 1.4208 1.4202 1.5536 2.1322 2.3793 1.4626 1.6314 1.3205 1.9156 1.2765 1.4730 1.7401 1.5470 1.6349 8.6511 2.5560 1.4392 1.2076 1.1117 1.0643 1.0718 1.0504 1.0901 1.5112 1.1160 1.2132 1.2149 6.6170 7.2436 6.7714 1.0643 1.0314 1.0332 1.0655 1.0608 1.0625 1.0914 1.0983 1.0991 1.1037 1.1040 1.1033 1.0902 1.1007 1.0990 1.0875 1.0915 1.0962
irintensity: 1.2234 1.9280 5.5858 3.7198 1.7079 3.8623 0.5853 0.2104 3.1340 2.9646 3.2881 1.4116 2.6793 2.0684 1.0937 1.4162 2.5742 3.0132 6.0144 1.0624 5.5581 2.6745 6.7047 6.6863 3.2502 32.0369 3.6796 3.3584 10.1760 23.1070 18.4827 15.7715 3.4362 23.0286 4.5458 4.6847 1.1291 9.2476 34.5072 48.6132 34.4545 3.8015 0.1970 11.9565 15.1917 0.3317 1.2763 11.4315 0.1018 8.2089 2.2534 202.7224 8.9604 0.3075 1.0261 16.1276 40.3886 2.2875 2.0618 8.3843 2.8840 1.6508 13.0110 62.9573 1.2325 4.7725 4.6710 3.2472 23.5875 12.7435 21.1897 144.2283 8.8880 3.5330 12.4762 41.1552 34.9539 3.5914 43.5891 75.4847 66.6161 28.8387 30.4022 24.3771 54.8405 17.9238 76.2998 50.3722 44.3920 64.8571 21.6008 31.3609 26.3487 8.3105 2.5268 12.1703
temp: 298.150 k
press: 1.00000 atm
elementType: 8 8 6 6 6 6 6 6 6 6 6 6 6 6 6 6 1 1 1 1 1 1 1 1 1 1 1 1 1 1 1 1 1 1
symmnumber: 1
zpe: 749049.9 jmol-1
zpe.correction: 0.285298 hartree
zpe.thermalcorrener: 0.301179 hartree
zpe.thermalcorrenthalpy: 0.302123 hartree
zpe.thermalcorrgfe: 0.242001 hartree
zpe.sumelectzpe: -693.487792 hartree
zpe.sumelectthermal: -693.471911 hartree
zpe.sumelectthermalent: -693.470967 hartree
zpe.sumelectthermalfe: -693.531089 hartree
dipole: 0.7495 0.1605 -1.2635
dipole: 1.4779
quadrupole: -74.8922 -95.5728 -96.7856
quadrupole: 1.1493 1.9054 -3.5251
quadrupole: 14.1914 -6.4893 -7.7021 1.1493 1.9054 -3.5251
hfenergy: -693.7730897 hartree
pointgroup: C01 [X(C14H18O2)]
dipole: 0.2877089 0.2265607 -0.4516258 debye
polarizability: 216.2683444|-3.0556931|147.0809334|4.5617213|23.4771125|118.4728726 unknown
InChI: InChI=1S/C14H18O2/c1-15-12-8-9-14(16-2)13(10-12)11-6-4-3-5-7-11/h6,8-10H,3-5,7H2,1-2H3
charge 0 multiplicity 1
34 atoms
O  -0.283366 2.274382 1.063551
O  3.385057 -1.622685 -0.73681
C  -3.471236 -0.955814 1.075048
C  -2.151441 -0.156499 1.177458
C  -4.152099 -0.722605 -0.291673
C  -1.284334 -0.305211 -0.074521
C  -3.238837 -1.221225 -1.436136
C  -1.791969 -0.809422 -1.238949
C  0.167056 0.050358 0.030179
C  0.624931 1.278763 0.60215
C  1.148708 -0.873234 -0.403695
C  2.532114 -0.607115 -0.265703
C  2.000543 1.537298 0.751983
C  2.970565 0.600356 0.329387
C  -0.949962 3.02473 -0.017747
C  4.825346 -1.408612 -0.593482
H  -3.260523 -2.038033 1.191973
H  -4.147314 -0.66664 1.902259
H  -1.568906 -0.490989 2.057852
H  -2.362764 0.914571 1.361862
H  -4.346292 0.361374 -0.419783
H  -5.131821 -1.235238 -0.335151
H  -3.60294 -0.842181 -2.412541
H  -3.295945 -2.329382 -1.507052
H  -1.123954 -0.916079 -2.106179
H  0.843713 -1.837188 -0.822401
H  2.300811 2.487899 1.204754
H  4.033205 0.820953 0.465078
H  -1.537839 2.35177 -0.671923
H  -0.20362 3.569707 -0.628846
H  -1.61819 3.742483 0.483541
H  5.294113 -2.310076 -1.015079
H  5.114644 -1.301645 0.47068
H  5.160148 -0.516172 -1.158286
