program: Gaussian 09
title: 000278093
version: EM64L-G09RevD.01
frameworkgroup: C1[X(C9H8N2O)]
method: RPBEPBE
basis: SDD
operation: Freq
keyword: #pfreq=noraman
keyword: PBEPBE/SDD
title: #p freq=noraman PBEPBE/SDD
converged: NO YES NO YES
title: Mulliken charges:
elementType: O N N C C C C C C C C C H H H H H H H H
charge: -0.273077 -0.249725 -0.046250 0.131648 0.276528 0.232479 -0.127402 -0.493510 -0.307337 -0.236980 -0.163180 -0.769595 0.297670 0.254669 0.271451 0.239646 0.247816 0.224780 0.245184 0.245184
chargesum: 0.00000
title: Mulliken charges with hydrogens summed into heavy atoms:
elementType: O N N C C C C C C C C C
charge: -0.273077 -0.249725 -0.046250 0.131648 0.276528 0.232479 0.170267 -0.238840 -0.035886 0.002666 0.084636 -0.054446
polarizability: 1.72610428e+02 -1.94128721e+00 1.29558373e+02 -2.53908291e-03 -2.40290964e-03 4.89635627e+01
1716.lowfreq: -10.7506 -0.0006 0.0003 0.0004 2.9337 9.2548 94.4833 101.1717 155.8999
frequency: 94.4787 101.1684 155.8999 183.6448 263.6324 281.4018 327.3362 419.1453 430.8308 486.5012 523.7261 534.9029 574.8146 619.2776 651.5451 674.1794 714.0828 763.0921 783.8306 842.5780 852.6326 879.5113 958.8806 979.7624 998.0793 1011.7475 1018.1044 1040.2745 1046.1894 1117.4459 1146.2259 1172.7226 1204.4029 1255.0464 1300.2981 1330.2340 1392.5923 1409.5907 1435.2457 1453.0751 1458.0584 1488.4987 1520.1580 1551.2376 1630.8410 1664.6841 2991.8826 3075.8107 3110.5080 3155.3076 3173.1401 3183.9386 3188.4578 3195.7335
redmass: 1.6170 1.7215 4.6827 4.1440 3.2013 5.2296 5.7632 3.4112 6.3459 5.8724 3.0256 6.8422 6.5720 3.8954 5.8085 3.3503 5.3602 4.3093 1.3622 5.7695 1.4540 1.4253 5.3065 1.3287 1.3112 1.5192 2.1947 5.8615 1.5879 1.7656 1.8384 2.3072 1.5742 1.5510 3.4503 2.2032 1.2723 2.1493 3.5182 1.0458 1.2563 4.1063 4.3495 6.6739 6.1049 9.5077 1.0368 1.0970 1.1005 1.0889 1.0895 1.0923 1.0959 1.1009
irintensity: 3.6916 2.1028 0.8083 3.4415 2.6092 4.3176 2.0693 4.4530 0.0131 3.4367 3.3040 2.2656 2.1216 7.4447 4.5178 3.5350 10.5405 2.4116 85.4486 0.4459 39.3124 0.2634 14.8817 3.9413 0.1985 8.5878 4.8034 8.2054 11.5257 19.8956 18.1452 16.5999 11.1056 0.5527 6.1402 5.9659 20.3691 66.9117 190.9687 15.1645 14.3431 242.1868 33.7370 1.7221 88.8849 400.1746 11.4686 11.4432 20.6495 9.7514 5.0466 2.1936 1.2741 10.7611
temp: 298.150 k
press: 1.00000 atm
elementType: 8 7 7 6 6 6 6 6 6 6 6 6 1 1 1 1 1 1 1 1
symmnumber: 1
zpe: 399650.7 jmol-1
zpe.correction: 0.152219 hartree
zpe.thermalcorrener: 0.161729 hartree
zpe.thermalcorrenthalpy: 0.162673 hartree
zpe.thermalcorrgfe: 0.117351 hartree
zpe.sumelectzpe: -531.654200 hartree
zpe.sumelectthermal: -531.644689 hartree
zpe.sumelectthermalent: -531.643745 hartree
zpe.sumelectthermalfe: -531.689068 hartree
dipole: 1.9805 -2.6051 -0.0001
dipole: 3.2725
quadrupole: -51.6620 -79.3416 -72.0489
quadrupole: -1.1497 -0.0004 0.0000
quadrupole: 16.0221 -11.6574 -4.3647 -1.1497 -0.0004 0.0000
hfenergy: -531.8064186 hartree
pointgroup: C01 [X(C9H8N2O1)]
dipole: -0.8421727 0.9738424 -0.0000218 debye
dipolederiv: -0.3732882 -0.2316081 -0.0000095 0.0804186 -1.3739079 -0.0000484 0.0000021 0.000012 -0.372792 -0.4469879 0.4190723 0.0000006 -0.293155 -0.6103405 -0.0000209 -0.0000116 -0.0000202 0.016266 -1.6237014 0.2469972 -0.0000157 -0.00686 -0.4670114 -0.0000085 -0.0000368 0.0000089 -0.2691972 1.1863695 -0.0001827 0.0000167 0.4411708 0.143341 0.0000069 0.0000465 -0.0000023 0.1317768 0.4586787 0.2293354 0.0000152 -0.2444255 1.75282 0.0000524 -0.0000129 0.0000236 0.1959794 1.179517 -0.0105075 0.0000145 -0.1533311 0.8757368 0.0000268 -0.0000166 0.0000026 0.0502415 0.0343699 -0.1993276 -0.0000045 0.1861217 0.0038365 0.0000094 0.0000132 -0.0000003 -0.0328906 -0.2296245 -0.5777944 -0.0000128 -0.0013265 -0.7010483 -0.0000162 0.0000103 -0.0000334 -0.2193233 -0.5320672 0.0138078 -0.0000069 0.0940365 0.0772813 0.0000105 -0.0000073 0.0000089 -0.1648294 0.0830244 0.25343 0.0000148 -0.2173808 -0.1158161 -0.0000018 -0.0000048 0.0000043 -0.1878986 0.2695044 -0.1134042 0.0000019 0.2348145 0.1834871 0.0000159 0.0000143 0.0000093 -0.0954981 -0.2112408 -0.1335298 0.0000037 -0.3115848 -0.0637663 -0.0000115 0.0000683 0.0000229 0.0181467 0.1333307 0.0359803 0.0000012 -0.0562497 0.0817798 -0.0000064 -0.0000031 -0.0000025 0.1815937 -0.0092487 0.053343 -0.0000074 0.0740576 0.0517357 -0.0000036 -0.0000125 -0.0000009 0.1755661 0.0912645 -0.0400791 -0.0000031 0.0066998 -0.0083157 -0.0000065 -0.0000011 -0.0000081 0.1678678 -0.0350445 -0.0649353 -0.0000071 -0.0687342 0.0597754 -0.0000056 -0.0000073 -0.0000046 0.1714682 -0.0237671 0.095059 0.0000005 0.0960897 0.0341067 -0.0000032 0.0000019 -0.000003 0.1586784 -0.0577338 0.0510314 -0.000027 0.1647981 -0.0169808 0.0000305 -0.0000431 0.0000091 0.115129 0.0533325 -0.0133253 0.0124172 -0.0125699 0.0466246 -0.1022262 -0.0398679 -0.1115686 -0.0201192 0.0533126 -0.0133625 -0.0123923 -0.01259 0.046662 0.1022063 0.0398684 0.1115423 -0.020165 unknown
polarizability: 172.6837256|0.7794895|129.4850752|0.0023827|0.002558|48.9635627 unknown
InChI: InChI=1S/C9H8N2O/c1-7-6-9(12)11-5-3-2-4-8(11)10-7/h2-6H,1H3
charge 0 multiplicity 1
20 atoms
O  0.447083 -2.72976 0.00004
N  -0.482722 -0.545158 0.000052
N  0.943897 1.426654 0.000157
C  -0.283191 0.861298 0.000112
C  0.67808 -1.485504 0.000019
C  2.046203 0.592715 0.000156
C  -1.75527 -1.106862 0.000006
C  1.942854 -0.806289 0.000105
C  -1.46398 1.681797 0.000123
C  -2.885314 -0.308454 0.000019
C  -2.735075 1.119651 0.000078
C  3.384387 1.29279 0.00022
H  -1.756296 -2.200109 -0.000041
H  2.834825 -1.436593 0.000131
H  -1.295115 2.761085 0.000168
H  -3.873262 -0.774695 -0.000019
H  -3.621158 1.762174 0.000088
H  4.222263 0.577497 0.000386
H  3.467449 1.946787 0.886988
H  3.467641 1.946577 -0.886688
