program: Gaussian 09
title: 000278320
version: EM64L-G09RevD.01
frameworkgroup: C1[X(C24H24ClN5OS)]
method: RPBEPBE
basis: SDD
operation: Freq
keyword: #p
keyword: freq=noraman
keyword: PBEPBE/SDD
title: #p freq=noraman PBEPBE/SDD
converged: YES YES NO NO
title: Mulliken charges:
elementType: Cl S O N N N N N C C C C C C C C C C C C C C C C C C C C C C C C H H H H H H H H H H H H H H H H H H H H H H H H
charge: -0.070011 0.270941 -0.251480 -0.140996 -0.191214 -0.027262 0.009642 -0.013967 -0.361361 -0.346084 -0.305420 0.140369 -0.792965 0.103670 -0.225086 -0.305028 0.252847 0.530723 0.486865 -0.608056 -0.769896 -0.421192 -0.358827 -0.353417 -0.380025 -0.379888 -0.226690 -0.233842 -0.240621 -0.238151 -0.240773 -0.236932 0.243485 0.261176 0.201366 0.215187 0.223241 0.229404 0.340858 0.287718 0.264135 0.262514 0.245179 0.267372 0.263761 0.237262 0.244154 0.256330 0.258350 0.251814 0.227642 0.226991 0.228388 0.227391 0.230132 0.230279
chargesum: 0.00000
title: Mulliken charges with hydrogens summed into heavy atoms:
elementType: Cl S O N N N N N C C C C C C C C C C C C C C C C C C C C C C C C
charge: -0.070011 0.270941 -0.251480 -0.140996 -0.191214 -0.027262 0.009642 -0.013967 0.143300 0.070469 0.147225 0.140369 -0.452107 0.103670 0.062632 -0.305028 0.252847 0.530723 0.486865 -0.081407 0.006416 -0.183930 -0.114673 -0.097088 -0.121674 -0.128074 0.000953 -0.006851 -0.012234 -0.010760 -0.010641 -0.006653
polarizability: 4.41608377e+02 -1.70188204e+01 3.25894738e+02 2.69437313e+01 6.93245004e+00 2.53873089e+02
1716.lowfreq: -11.2306 -3.3840 -0.8940 0.0015 0.0016 0.0019 3.0665 4.5267 8.2519
frequency: -3.9788 2.3418 8.1638 15.1494 29.6898 34.2790 37.0126 41.6241 47.3977 57.7211 69.5726 76.5733 88.5144 104.6277 113.8114 126.0354 128.3979 130.3508 151.8369 159.1975 176.4111 215.3029 230.1641 246.6250 253.5363 268.5606 281.1885 307.1162 323.8031 336.9726 386.1852 400.4548 402.5654 405.3704 411.0627 420.9885 477.1391 485.6214 521.3004 546.9360 549.2894 573.0233 580.2790 595.3288 612.1979 614.2552 625.5838 627.5006 642.8413 666.5833 675.1075 679.7332 692.0327 702.9957 704.6207 749.6281 751.6293 776.7620 780.4076 790.8693 804.0497 819.4860 829.7649 851.2831 854.0269 856.2247 862.7449 890.6357 922.9275 924.2134 932.5763 938.6085 955.1744 976.1435 982.7131 990.0843 990.2503 995.7407 998.9998 1025.9525 1026.6952 1028.7207 1034.4066 1036.8412 1056.2261 1077.7809 1080.0373 1086.5920 1087.0766 1101.1971 1141.8402 1169.5262 1172.8149 1173.3172 1176.4960 1181.7037 1189.1353 1192.8105 1195.8781 1215.4936 1217.6132 1235.7362 1248.1958 1274.8502 1275.9887 1285.5117 1289.0134 1293.0386 1297.1891 1300.8393 1323.7176 1344.2773 1344.7730 1349.4440 1369.1073 1380.6682 1383.9369 1385.3055 1388.8421 1391.2544 1431.7027 1436.9817 1443.0206 1452.2245 1456.2446 1460.1373 1467.2967 1471.8461 1480.4235 1483.2336 1484.2986 1516.8258 1535.4663 1590.7809 1591.7296 1609.6942 1611.9111 1626.9663 2975.4170 2997.7579 3000.3198 3004.7931 3026.1815 3030.5796 3047.2683 3060.3489 3087.2495 3087.6589 3121.5816 3122.9827 3127.2237 3129.4561 3129.7745 3138.2195 3138.8714 3142.6145 3148.8168 3155.5015 3164.7106 3166.9352 3173.2029 3234.7257
redmass: 6.7073 4.0105 6.5535 7.2514 5.8295 2.6058 6.5910 4.5638 5.4243 5.1747 4.2774 4.3997 2.6810 7.1212 2.6696 1.8351 2.8326 2.2487 5.2196 7.7533 9.1879 6.6543 4.5540 4.7312 4.4876 4.8551 4.9243 4.6196 4.7233 6.8450 3.6208 2.8121 6.2273 2.9220 5.8794 9.6955 3.6200 4.2087 3.6999 4.7577 5.8406 4.0048 5.8053 7.0995 6.0662 6.0173 5.7860 7.2288 5.2411 7.4821 5.3014 5.9070 5.7724 1.6024 1.7980 1.0949 2.1562 1.2290 2.0805 5.1860 6.4164 4.1027 1.5927 1.3234 3.2844 1.3025 2.4561 3.5729 1.4299 1.4366 1.4666 2.1267 2.3484 1.3897 1.4037 6.2271 5.7670 1.3125 1.3140 3.3005 2.3195 2.1376 2.5281 2.1532 1.4907 2.2646 1.6352 2.5876 1.6857 4.7713 3.5477 2.4617 1.1116 1.0744 2.5789 2.3907 1.1452 1.1490 1.2755 1.7678 2.0064 1.2050 1.5840 3.8810 2.1729 1.4070 1.2655 1.8534 2.1096 4.0584 1.3132 1.6713 1.9181 1.3964 1.4311 8.1741 1.9820 1.8102 4.0633 1.8078 4.5921 2.2514 2.0892 1.0835 1.1004 1.0988 1.0492 1.0769 2.2251 2.3051 1.0991 9.6333 10.9574 6.0026 5.9911 6.0197 6.0412 8.2910 1.0599 1.0601 1.0379 1.0646 1.0846 1.0984 1.0565 1.1037 1.0978 1.1018 1.0857 1.0847 1.0876 1.0877 1.1115 1.0994 1.0922 1.0929 1.0965 1.0953 1.1016 1.1005 1.0924 1.0994
irintensity: 0.0837 0.0156 0.0511 0.0550 0.3852 1.9811 0.0966 0.1008 0.5523 0.7064 0.4517 1.9448 1.8345 2.3995 5.1694 0.8361 0.3955 2.1318 0.5331 0.7180 1.6022 6.6207 1.0887 2.1201 0.1728 1.1241 0.4402 2.0535 3.4854 3.8909 2.3522 0.2393 1.5877 2.1809 25.6195 6.2588 6.1636 1.4160 3.8543 2.0623 9.0169 6.4913 23.8297 8.1118 13.6526 12.2709 58.6248 4.5219 29.5607 12.0697 22.2522 43.4925 7.5771 105.4267 33.8886 19.2131 44.0915 0.6169 28.3906 7.3189 50.0189 7.7445 9.9880 0.9668 2.2002 0.9011 3.3902 121.9245 0.4580 10.4545 0.5338 10.9685 32.4462 0.4975 0.1116 0.7169 0.7798 0.1886 0.0527 10.0343 3.0146 11.9406 6.4428 1.9924 8.2652 20.7284 5.2067 2.1394 9.2416 2.2218 24.9728 111.5115 0.3077 2.5634 4.1894 29.5356 2.2640 1.3128 6.0449 20.3638 41.4274 5.1977 98.0949 34.5845 6.3884 98.5618 7.3969 32.8460 96.2222 44.8672 1.4600 50.7063 58.1977 4.4459 9.6743 0.5572 68.0230 6.9196 13.8761 40.6354 9.1728 13.5372 11.4675 41.3235 9.3295 6.6899 25.6365 0.4314 13.0444 21.9350 19.8121 346.9446 42.8356 0.5610 1.3290 4.9237 2.8262 272.4843 16.4254 7.8105 2.9554 22.0791 30.4561 12.2149 25.5712 23.9458 6.4502 11.4827 6.0038 4.1048 0.1983 1.7779 23.5703 12.3373 17.3385 28.3987 27.5524 24.7260 24.8238 24.4497 10.8178 0.9354
temp: 298.150 k
press: 1.00000 atm
elementType: 17 16 8 7 7 7 7 7 6 6 6 6 6 6 6 6 6 6 6 6 6 6 6 6 6 6 6 6 6 6 6 6 1 1 1 1 1 1 1 1 1 1 1 1 1 1 1 1 1 1 1 1 1 1 1 1
symmnumber: 1
zpe: 1140512.1 jmol-1
zpe.correction: 0.434398 hartree
zpe.thermalcorrener: 0.464009 hartree
zpe.thermalcorrenthalpy: 0.464953 hartree
zpe.thermalcorrgfe: 0.365428 hartree
zpe.sumelectzpe: -2133.751583 hartree
zpe.sumelectthermal: -2133.721973 hartree
zpe.sumelectthermalent: -2133.721028 hartree
zpe.sumelectthermalfe: -2133.820553 hartree
dipole: -2.8194 -0.4532 -0.8692
dipole: 2.9850
quadrupole: -219.6637 -199.6564 -201.7416
quadrupole: -6.7829 -12.1076 5.5474
quadrupole: -12.6432 7.3642 5.2790 -6.7829 -12.1076 5.5474
hfenergy: -2134.1859811 hartree
pointgroup: C01 [X(C24H24Cl1N5O1S1)]
dipole: -0.9744169 -0.654845 0.0293015 debye
polarizability: 437.7959383|35.4925241|317.397943|8.9595674|-30.532431|266.1823219 unknown
InChI: InChI=1S/C24H24ClN5OS/c1-18(31)29(15-9-8-14-25)30-17-28-21-23(30)26-16-27-24(21)32-22(19-10-4-2-5-11-19)20-12-6-3-7-13-20/h2-7,10-13,16-17,22H,8-9,14-15H2,1H3
charge 0 multiplicity 1
56 atoms
Cl 6.3373 4.358791 -4.129704
S  -1.646878 -1.775802 -0.331682
O  6.483436 -0.500213 1.623302
N  4.54693 -0.248369 0.380156
N  3.264808 -0.711569 0.063119
N  1.607323 -1.816199 -1.073594
N  1.89271 0.400945 1.814768
N  -0.487474 -0.132546 1.571978
C  4.924292 1.097321 -0.120719
C  5.223127 1.124431 -1.634608
C  5.594828 2.557747 -2.09275
C  2.067659 -0.392094 0.726642
C  -3.153237 -0.956721 0.602477
C  1.053172 -1.089423 0.001664
C  2.921047 -1.564616 -1.008343
C  -0.275724 -0.925724 0.480343
C  5.344831 -0.947958 1.320929
C  -3.563904 0.328339 -0.093151
C  -4.223329 -2.031294 0.775784
C  5.894092 2.598562 -3.591536
C  4.748638 -2.21698 1.910818
C  -3.70131 1.509935 0.67819
C  -3.944569 -3.143341 1.616886
C  -3.840564 0.384319 -1.484311
C  -5.500905 -1.942169 0.169552
C  0.577929 0.479618 2.176613
C  -4.121656 2.718931 0.07804
C  -4.912914 -4.142673 1.83946
C  -4.25548 1.591237 -2.086589
C  -6.473855 -2.944498 0.392759
C  -4.402115 2.763023 -1.306296
C  -6.184861 -4.048316 1.224282
H  4.110027 1.803452 0.130696
H  5.822228 1.380757 0.454243
H  4.337222 0.772652 -2.201448
H  6.054677 0.426134 -1.851836
H  4.764019 3.253077 -1.866302
H  6.47903 2.914466 -1.53157
H  -2.699962 -0.712185 1.579747
H  3.680096 -1.957267 -1.681861
H  6.766294 1.985348 -3.865991
H  5.022968 2.321069 -4.205164
H  4.437418 -2.93688 1.134048
H  5.51206 -2.682309 2.550328
H  3.862005 -1.980051 2.525984
H  -3.472264 1.48172 1.74979
H  -2.957382 -3.224649 2.087829
H  -3.704874 -0.513728 -2.098157
H  -5.745622 -1.082078 -0.461043
H  0.348242 1.10054 3.046809
H  -4.222003 3.623573 0.688123
H  -4.679776 -4.992962 2.490125
H  -4.460123 1.620447 -3.162718
H  -7.457876 -2.858264 -0.08168
H  -4.722557 3.700377 -1.774657
H  -6.939387 -4.824131 1.395828
