program: Gaussian 09
title: 000278097
version: EM64L-G09RevD.01
frameworkgroup: C1[X(C10H17NO5)]
method: RPBEPBE
basis: SDD
operation: Freq
keyword: #p
keyword: freq=noraman
keyword: PBEPBE/SDD
title: #p freq=noraman PBEPBE/SDD
converged: YES YES NO NO
title: Mulliken charges:
elementType: O O O O O N C C C C C C C C C C H H H H H H H H H H H H H H H H H
charge: -0.236958 -0.277596 -0.248849 -0.423612 -0.263747 -0.384901 -0.158914 -0.132144 -0.082927 -0.109529 0.333924 -0.363033 -0.682709 -0.673649 0.257622 -0.780530 0.263541 0.318119 0.238840 0.238097 0.223164 0.211764 0.308391 0.224043 0.232266 0.223281 0.226580 0.229580 0.227130 0.339288 0.254069 0.209735 0.259664
chargesum: 0.00000
title: Mulliken charges with hydrogens summed into heavy atoms:
elementType: O O O O O N C C C C C C C C C C
charge: -0.236958 -0.277596 -0.248849 -0.084325 -0.263747 -0.076510 0.104626 0.185974 0.155913 0.128568 0.333924 0.071896 -0.003118 0.009641 0.257622 -0.057062
polarizability: 1.56898053e+02 3.60616050e+00 1.17171183e+02 -4.18005807e+00 2.87965374e-01 1.12575811e+02
1716.lowfreq: -0.0009 -0.0006 -0.0004 5.7036 6.9989 13.3498 31.3359 41.1434 52.2825
frequency: 31.0563 41.0691 52.2637 59.0974 69.6723 93.9254 109.9873 121.6259 167.9589 189.4949 213.8206 229.7927 258.1116 289.5001 296.4644 306.5602 323.9140 370.3996 400.5314 448.5633 469.2322 491.3810 545.9159 562.3400 599.7824 613.6080 624.7153 627.7789 695.2271 735.0903 777.1367 811.4007 838.9971 840.8268 884.6776 911.6802 918.6637 933.0601 955.2747 973.9422 977.6445 984.5796 993.7945 1016.1375 1020.3783 1040.8477 1042.1776 1080.7085 1139.6343 1149.3406 1170.7539 1199.7249 1206.2862 1231.8353 1245.3486 1260.6960 1265.2118 1275.2029 1293.1780 1314.5531 1325.0507 1334.9093 1361.3890 1381.6065 1387.1564 1389.7695 1394.5015 1449.8052 1450.6012 1452.9098 1463.8649 1470.3554 1471.5005 1472.3706 1476.9378 1623.6251 2982.1255 2991.1292 2995.6704 2996.0209 3006.8230 3044.9501 3084.3945 3092.1466 3095.5684 3096.5632 3096.6957 3102.9638 3103.2247 3112.1219 3116.3574 3542.9429 3561.3290
redmass: 5.1677 3.9330 4.6517 3.7357 1.4626 2.4277 3.7526 3.9449 1.0375 2.8557 3.4296 1.2825 2.8975 2.9255 1.7889 2.4435 2.7667 3.4025 3.2711 3.3166 3.6186 4.9992 2.1226 3.3645 4.5183 1.6673 4.4820 3.9782 4.3355 6.0455 4.6154 4.8557 4.6385 2.6864 3.9627 5.1232 1.8264 2.1781 2.2847 3.1462 2.0782 1.6232 3.0660 3.9936 2.1650 1.9799 1.7652 1.6260 1.9149 2.5732 1.6250 2.1421 2.1132 1.5615 1.7789 1.8363 1.6347 1.2954 1.4677 1.2138 1.2183 1.5824 1.2643 1.2928 1.2266 1.4421 1.2377 1.0527 1.0478 1.0499 1.2828 1.0685 1.1155 1.0507 1.4858 6.8521 1.0832 1.0684 1.0354 1.0362 1.0356 1.0877 1.0892 1.0865 1.0994 1.0997 1.0971 1.1004 1.0991 1.0998 1.1007 1.0775 1.0664
irintensity: 1.0024 0.8258 11.6449 4.3372 0.8685 4.1675 0.5428 6.8503 0.1307 12.4459 6.0105 1.5289 1.2547 29.6278 59.7750 25.7524 66.8875 3.7307 0.7047 27.7108 14.3785 17.2190 48.0800 9.2456 10.2957 28.3192 6.3911 33.8285 2.7461 18.8958 32.2265 2.3166 36.9455 28.5490 9.2913 203.9995 10.4576 21.9264 76.3629 49.0623 6.7557 49.1593 75.8876 58.3533 11.1008 11.3072 4.1817 5.1890 45.8803 17.7918 18.8375 68.0545 59.4682 14.0788 28.3514 11.1734 76.7548 2.8554 16.0781 15.1131 13.8731 47.6105 11.4113 44.7351 70.5032 11.7332 20.7491 22.8994 0.2129 4.8796 156.1401 1.1822 18.3038 11.4383 129.8503 188.6373 32.3214 45.8033 10.9112 11.0620 9.6263 19.9721 30.3047 6.8271 14.6269 13.5624 48.5610 2.6833 12.2546 24.8301 27.9486 17.8989 8.0002
temp: 298.150 k
press: 1.00000 atm
elementType: 8 8 8 8 8 7 6 6 6 6 6 6 6 6 6 6 1 1 1 1 1 1 1 1 1 1 1 1 1 1 1 1 1
symmnumber: 1
zpe: 704121.7 jmol-1
zpe.correction: 0.268186 hartree
zpe.thermalcorrener: 0.285463 hartree
zpe.thermalcorrenthalpy: 0.286408 hartree
zpe.thermalcorrgfe: 0.221989 hartree
zpe.sumelectzpe: -820.851159 hartree
zpe.sumelectthermal: -820.833882 hartree
zpe.sumelectthermalent: -820.832938 hartree
zpe.sumelectthermalfe: -820.897356 hartree
dipole: 1.7513 0.0720 2.4890
dipole: 3.0442
quadrupole: -93.6753 -93.5298 -100.4199
quadrupole: -1.6607 -16.8448 -12.0349
quadrupole: 2.1997 2.3452 -4.5449 -1.6607 -16.8448 -12.0349
hfenergy: -821.1193451 hartree
pointgroup: C01 [X(C10H17N1O5)]
dipole: -0.7201762 0.0585653 -0.9551964 debye
polarizability: 156.6985159|-2.6947145|117.0757273|-5.7014623|-0.0816322|112.8708044 unknown
InChI: InChI=1S/C10H17NO5/c1-5(13)11-7-6(4-12)14-9-8(7)15-10(2,3)16-9/h6-9,11-12H,4H2,1-3H3
charge 0 multiplicity 1
33 atoms
O  -0.372437 1.281381 -1.369488
O  -1.524842 -0.632639 0.963561
O  -2.5338 0.228771 -0.987402
O  2.038056 2.801878 1.086418
O  2.846143 -1.643505 1.257574
N  1.909756 -0.40853 -0.475601
C  -0.523963 -0.785262 -0.10785
C  0.742612 0.011825 0.302606
C  -1.125009 0.023996 -1.307621
C  0.298983 1.454715 -0.040077
C  -2.844352 -0.423531 0.325567
C  1.376277 2.531291 -0.195914
C  -3.645141 0.54464 1.188665
C  -3.543366 -1.763902 0.059798
C  2.912713 -1.202493 0.072362
C  4.092617 -1.495664 -0.848869
H  -0.315011 -1.847124 -0.322192
H  0.96936 -0.144939 1.369005
H  -1.057384 -0.423147 -2.310923
H  -0.456663 1.772198 0.708398
H  0.916963 3.443695 -0.62697
H  2.184878 2.195648 -0.863611
H  1.987901 -0.081366 -1.440488
H  -3.809254 0.112075 2.190245
H  -3.099683 1.49648 1.292352
H  -4.623973 0.745562 0.722058
H  -3.783729 -2.263286 1.014023
H  -4.476917 -1.596598 -0.503969
H  -2.894842 -2.43176 -0.533718
H  1.382467 3.194189 1.717147
H  4.258355 -2.585477 -0.888286
H  3.958843 -1.114126 -1.87615
H  5.002541 -1.042295 -0.418351
