program: Gaussian 09
title: 000278078
version: EM64L-G09RevD.01
frameworkgroup: C1[X(C17H17N3O2)]
method: RPBEPBE
basis: SDD
operation: Freq
keyword: #p
keyword: freq=noraman
keyword: PBEPBE/SDD
title: #p freq=noraman PBEPBE/SDD
converged: YES YES NO NO
title: Mulliken charges:
elementType: O O N N N C C C C C C C C C C C C C C C C C H H H H H H H H H H H H H H H H H
charge: -0.305312 -0.298803 -0.083787 -0.001227 -0.026165 -0.429190 -0.571408 0.564934 -0.258494 -0.301900 -0.126566 0.310826 -0.542973 -0.248242 -0.414142 0.224910 -0.336975 0.178368 -0.147357 -0.281248 -0.530621 -0.530236 0.244071 0.246598 0.232625 0.231476 0.277102 0.272366 0.245181 0.255466 0.237806 0.236425 0.252417 0.222151 0.256647 0.233148 0.225399 0.253524 0.233207
chargesum: 0.00000
title: Mulliken charges with hydrogens summed into heavy atoms:
elementType: O O N N N C C C C C C C C C C C C C C C C C
charge: -0.305312 -0.298803 -0.083787 -0.001227 -0.026165 0.061479 -0.107307 0.564934 0.018608 -0.029534 0.118616 0.310826 -0.287507 -0.010437 -0.177717 0.224910 -0.084559 0.178368 -0.147357 -0.281248 0.181325 0.181894
polarizability: 3.16854455e+02 -2.09838851e+01 2.05412244e+02 6.20522094e+00 9.09091177e+00 1.24483718e+02
1716.lowfreq: -5.5000 -0.0006 -0.0005 0.0005 3.5474 3.6273 17.8912 20.5713 24.9242
frequency: 16.7411 20.4931 24.7019 40.3794 45.6568 71.2594 92.3563 107.8556 113.3808 124.5584 137.5715 156.1326 161.3529 168.5072 179.8748 229.4276 242.1460 276.9765 286.4626 315.1888 348.4261 353.6513 388.6742 396.8489 400.4176 432.7177 460.5817 487.6224 501.3477 503.8779 541.7882 571.5348 576.8885 595.4759 633.4765 644.9909 693.3290 708.6855 729.0904 743.8355 758.5759 792.4757 835.4119 864.5323 885.6783 890.3470 899.3007 908.5806 927.8247 944.3148 955.5548 976.0048 979.3548 1011.4524 1018.0603 1032.3315 1093.5911 1114.0803 1115.8294 1119.5819 1141.0683 1153.8458 1157.2663 1164.7564 1196.4753 1198.5282 1223.6359 1246.2772 1263.4895 1278.1193 1282.6069 1294.1151 1298.2703 1335.6368 1353.8363 1366.3164 1391.2549 1401.1250 1413.4373 1426.2990 1444.1471 1457.3854 1459.8876 1471.8044 1477.5395 1486.0411 1488.5551 1488.7747 1573.0832 1611.0221 1613.5926 1682.3385 2153.4651 2179.3969 2969.3785 2974.2514 2975.8145 2994.4967 3014.8256 3047.2453 3071.2384 3072.5215 3081.1781 3124.8586 3125.0443 3126.5048 3138.0331 3160.4456 3163.7198 3166.8666 3189.1138
redmass: 5.4730 6.3887 6.2154 4.4310 4.6953 5.6722 3.8596 7.0061 3.5259 3.0597 5.0125 1.1308 1.1373 5.1609 2.6997 5.7100 4.9142 3.2487 3.8241 5.2629 4.2592 3.3286 5.0860 5.4825 4.5916 4.4125 8.2459 3.6313 5.2469 5.4226 6.4386 5.8321 4.4657 5.0263 5.7654 5.0356 6.0233 5.8097 1.7471 3.0410 3.4003 1.1970 1.5377 4.0630 4.2590 1.7962 1.5740 2.7644 1.2846 6.5153 1.4311 3.8105 4.3580 4.3851 2.8721 1.7951 2.7030 1.2418 1.2433 2.9206 1.4938 1.3321 1.5251 1.3162 1.7156 1.1611 2.8838 2.0981 1.9660 1.3295 1.2744 1.6315 1.4833 1.6341 1.2620 6.5157 1.6479 2.2851 2.7540 1.1843 1.3687 1.0553 1.0682 1.1145 1.0749 2.7222 1.0530 1.0933 7.2104 6.7044 6.7154 6.3007 12.6138 12.5383 1.0829 1.0309 1.0311 1.0595 1.0603 1.1024 1.1038 1.1039 1.1064 1.1028 1.1029 1.0894 1.0917 1.0870 1.0954 1.0937 1.0998
irintensity: 1.1585 0.8589 2.5377 1.4524 1.2512 2.7002 4.4905 0.9094 4.6191 3.1979 4.6691 0.1563 0.0956 1.2808 6.0834 6.2657 6.2410 1.4839 3.7487 4.3747 0.5489 0.4966 1.5533 3.1025 0.9052 6.3804 5.9040 9.9002 12.3728 8.4537 6.0324 4.1480 18.3675 1.5386 3.2237 8.9980 6.7665 6.7312 21.6773 14.4463 10.1905 0.8797 26.0496 17.1235 8.4496 1.7029 33.2240 10.9443 3.8246 64.4239 7.4693 59.2045 28.0713 13.5355 17.6836 20.2745 43.3098 19.7693 9.5403 75.9556 22.5979 0.8022 8.5346 57.0389 78.1232 0.6795 79.5171 82.5505 79.2969 6.8106 2.4111 33.6206 2.9927 4.7939 18.0562 10.0448 5.0386 14.2853 137.6725 1.1117 18.3294 17.8880 5.5547 3.7079 13.6248 147.1869 25.1585 14.0915 10.7934 185.3790 2.5208 118.2559 96.4878 1.0752 10.5908 87.2834 58.7441 18.5632 42.0417 3.9448 32.2355 20.5378 13.3508 23.1439 23.9760 10.7683 6.4563 2.6698 5.7010 0.9580 7.5700
temp: 298.150 k
press: 1.00000 atm
elementType: 8 8 7 7 7 6 6 6 6 6 6 6 6 6 6 6 6 6 6 6 6 6 1 1 1 1 1 1 1 1 1 1 1 1 1 1 1 1 1
symmnumber: 1
zpe: 796809.2 jmol-1
zpe.correction: 0.303489 hartree
zpe.thermalcorrener: 0.325338 hartree
zpe.thermalcorrenthalpy: 0.326282 hartree
zpe.thermalcorrgfe: 0.249149 hartree
zpe.sumelectzpe: -971.027028 hartree
zpe.sumelectthermal: -971.005179 hartree
zpe.sumelectthermalent: -971.004235 hartree
zpe.sumelectthermalfe: -971.081368 hartree
dipole: 9.1675 -2.3185 -2.4506
dipole: 9.7685
quadrupole: -176.7344 -133.3943 -133.3302
quadrupole: 8.9105 18.6268 3.2690
quadrupole: -28.9148 14.4253 14.4894 8.9105 18.6268 3.2690
hfenergy: -971.330517 hartree
pointgroup: C01 [X(C17H17N3O2)]
dipole: 3.6079118 -0.9095462 -0.9622858 debye
polarizability: 316.6451548|-21.5255271|205.2533446|6.772899|10.2602555|124.8519171 unknown
InChI: InChI=1S/C17H17N3O2/c1-21-16-4-3-13(9-17(16)22-2)5-7-20-8-6-14(10-18)15(11-19)12-20/h3-4,6,8-9,12,14H,5,7H2,1-2H3
charge 0 multiplicity 1
39 atoms
O  4.829701 -1.71111 -0.35511
O  5.890788 0.816104 0.69889
N  -1.959336 -0.329935 0.108332
N  -6.378797 -1.71689 1.336502
N  -5.705809 2.795356 0.088915
C  -0.519679 -0.179194 0.41874
C  0.319976 0.333289 -0.788335
C  1.791222 0.456786 -0.422898
C  -4.811486 -0.643692 -0.565523
C  -2.832284 0.735534 0.258309
C  -2.418959 -1.478299 -0.571593
C  -4.167587 0.675185 -0.089129
C  2.661731 -0.653423 -0.553412
C  -3.717275 -1.645299 -0.944159
C  2.308912 1.663818 0.113818
C  4.017682 -0.568052 -0.174077
C  3.669577 1.766665 0.474478
C  4.537961 0.665145 0.317597
C  -5.695979 -1.228124 0.488131
C  -4.99057 1.834328 0.02283
C  5.435658 -2.248926 0.88727
C  6.867763 0.655789 -0.406021
H  -0.413604 0.518945 1.268103
H  -0.128155 -1.156622 0.754537
H  -0.083419 1.311888 -1.110044
H  0.188074 -0.366881 -1.634714
H  -5.465049 -0.444841 -1.439062
H  -2.402561 1.661144 0.65136
H  -1.65385 -2.225221 -0.800263
H  2.305073 -1.610005 -0.953144
H  -4.013401 -2.547223 -1.485228
H  1.653144 2.535495 0.226894
H  4.087806 2.699991 0.864808
H  4.642296 -2.609793 1.568823
H  6.045074 -1.48139 1.396674
H  6.063911 -3.092082 0.562869
H  6.724684 1.456743 -1.155596
H  6.762272 -0.332195 -0.889264
H  7.857694 0.754288 0.064294
