program: Gaussian 09
title: 000278069
version: EM64L-G09RevD.01
frameworkgroup: C1[X(C10H10N2O5S)]
method: RPBEPBE
basis: SDD
operation: Freq
keyword: #p
keyword: freq=noraman
keyword: PBEPBE/SDD
title: #p freq=noraman PBEPBE/SDD
converged: YES YES NO NO
title: Mulliken charges:
elementType: S O O O O O N N C C C C C C C C C C H H H H H H H H H H
charge: 1.077095 -0.248528 -0.144251 -0.201181 -0.500276 -0.535163 -0.142562 -0.278384 0.181897 0.187040 0.144160 0.144584 -0.337962 -0.343413 -0.204910 -0.205053 -0.582891 -0.609329 0.273449 0.269829 0.244343 0.243456 0.244072 0.270298 0.251998 0.239959 0.273574 0.288148
chargesum: 0.00000
title: Mulliken charges with hydrogens summed into heavy atoms:
elementType: S O O O O O N N C C C C C C C C C C
charge: 1.077095 -0.248528 -0.144251 -0.201181 -0.500276 -0.535163 -0.142562 -0.278384 0.181897 0.187040 0.144160 0.144584 -0.064513 -0.073584 0.039434 0.038403 0.183477 0.192352
polarizability: 3.22347488e+02 6.78774205e+00 1.85151190e+02 -5.09231892e+00 -2.45774738e-01 1.03674973e+02
1716.lowfreq: -2.3661 -0.0009 0.0017 0.0023 4.1791 12.1119 27.5117 31.9517 44.1565
frequency: 27.3226 31.9389 44.1341 65.1468 86.9131 110.5012 128.5043 142.6357 178.4570 183.6749 196.4766 202.7035 219.6049 237.7647 239.2853 300.4612 316.6825 322.8021 357.6987 376.2697 386.8620 410.9221 442.3634 450.7750 473.1249 491.8143 507.4780 565.0049 651.3927 689.2494 693.1193 697.5898 776.8981 792.4573 817.3730 855.1903 856.3419 908.0347 948.3486 961.1068 976.5650 1000.5078 1006.9864 1009.5122 1021.0941 1073.6203 1080.3241 1101.3355 1172.6747 1174.1036 1176.3801 1206.5788 1218.3957 1237.4788 1285.3271 1410.9590 1415.1540 1421.9804 1439.1715 1453.0954 1455.0214 1460.6544 1464.9825 1486.3313 1607.5643 1614.0103 1643.6626 1696.2929 2946.0237 2961.1226 3049.9685 3057.8034 3103.6607 3113.9535 3143.6417 3156.6073 3168.0128 3177.7429
redmass: 4.8215 5.9978 4.9326 5.9457 6.1877 5.8581 8.8220 5.8767 5.9660 1.1482 3.4361 1.7367 2.1468 6.6876 10.0902 4.1355 11.1131 12.1528 5.1504 3.8299 5.8105 4.2760 8.5514 4.9822 5.6232 8.7817 7.6607 13.5997 4.9329 5.7105 7.3136 4.3248 5.1268 1.5045 17.6644 7.7763 4.3886 1.3958 16.6898 9.5933 1.4085 9.0451 1.5322 1.3572 2.0692 1.2445 2.7502 1.3612 1.2096 1.9270 3.7491 1.6789 3.7684 10.1040 1.5040 1.1294 6.0476 1.1352 1.0446 2.7127 2.4560 1.0488 1.0496 1.0580 7.4663 7.3648 12.3037 12.8674 1.0411 1.0366 1.0928 1.0978 1.0996 1.0992 1.0867 1.0907 1.0957 1.1005
irintensity: 3.3079 3.0434 0.5949 1.2501 1.1378 2.9308 3.5546 0.3497 2.8420 1.0890 2.0805 2.0302 3.4742 2.4262 12.9250 11.2618 8.7139 8.2182 2.2848 7.9514 33.3102 18.9105 28.9500 2.8691 48.2259 5.9581 8.4373 26.4733 0.1984 21.3297 8.4267 32.6304 0.1551 55.1360 72.3463 36.5159 11.1043 0.0147 62.6398 71.4146 1.9656 46.6011 1.0537 0.0133 5.9597 1.9289 0.3902 1.9068 30.0230 4.0242 4.9813 107.6621 57.4658 600.1352 0.5779 24.0072 20.4767 1.6626 19.4997 6.0919 13.6205 29.1994 7.5011 48.0768 0.1006 14.0449 292.2352 97.8335 5.7007 43.9964 4.8298 11.4703 2.3127 3.1207 1.6351 4.3430 3.6345 22.7003
temp: 298.150 k
press: 1.00000 atm
elementType: 16 8 8 8 8 8 7 7 6 6 6 6 6 6 6 6 6 6 1 1 1 1 1 1 1 1 1 1
symmnumber: 1
zpe: 504421.7 jmol-1
zpe.correction: 0.192124 hartree
zpe.thermalcorrener: 0.210373 hartree
zpe.thermalcorrenthalpy: 0.211318 hartree
zpe.thermalcorrgfe: 0.144591 hartree
zpe.sumelectzpe: -1269.222439 hartree
zpe.sumelectthermal: -1269.204189 hartree
zpe.sumelectthermalent: -1269.203245 hartree
zpe.sumelectthermalfe: -1269.269972 hartree
dipole: -3.4866 5.6821 -0.1065
dipole: 6.6674
quadrupole: -76.6715 -117.7015 -117.2990
quadrupole: 11.4865 -8.6833 2.4942
quadrupole: 27.2192 -13.8109 -13.4083 11.4865 -8.6833 2.4942
hfenergy: -1269.4145628 hartree
pointgroup: C01 [X(C10H10N2O5S1)]
dipole: 1.1314043 -2.2282071 -0.7974632 debye
polarizability: 321.9358973|-10.4248058|176.6687606|6.7834801|24.9575831|112.5689927 unknown
InChI: InChI=1S/C8H4NO3.C2H6NO2S/c10-7-5-3-1-2-4-6(5)8(11)9(7)12;1-3(2)6(4)5/h1-4H;1-2H3
charge 0 multiplicity 1
28 atoms
S  -2.62162 1.151268 0.703855
O  -1.30986 1.578673 -1.03792
O  0.869089 2.968719 0.350655
O  -0.472015 -1.153475 -1.579231
O  -3.467011 2.459195 1.136771
O  -1.548797 0.438309 1.696866
N  -0.098996 1.065819 -0.759743
N  -3.877678 -0.171581 0.235599
C  2.063561 0.800266 0.071228
C  1.664729 -0.431696 -0.513406
C  0.953987 1.790434 -0.035598
C  0.273302 -0.310359 -1.029872
C  3.335316 0.958815 0.642463
C  2.528093 -1.537805 -0.544031
C  4.212878 -0.155413 0.616837
C  3.815366 -1.384985 0.031883
C  -4.788947 0.300437 -0.833301
C  -3.254977 -1.497901 0.042464
H  3.629281 1.911219 1.094089
H  2.210833 -2.482355 -0.996382
H  5.211957 -0.068218 1.056501
H  4.514239 -2.228015 0.027739
H  -4.358512 0.200933 -1.850165
H  -5.063877 1.350575 -0.641255
H  -5.706805 -0.311919 -0.768829
H  -4.085685 -2.220132 -0.062593
H  -2.667048 -1.755788 0.936934
H  -2.603805 -1.560817 -0.855054
