program: Gaussian 09
title: 000278076
version: EM64L-G09RevD.01
frameworkgroup: C1[X(C16H12N4O)]
method: RPBEPBE
basis: SDD
operation: Freq
keyword: #p
keyword: freq=noraman
keyword: PBEPBE/SDD
title: #p freq=noraman PBEPBE/SDD
converged: YES YES NO NO
title: Mulliken charges:
elementType: O N N N N C C C C C C C C C C C C C C C C H H H H H H H H H H H H
charge: -0.197053 -0.404043 -0.386504 -0.037137 -0.037195 -0.091661 0.300348 0.223910 0.223740 0.083055 0.265356 0.143328 0.143296 -0.390167 -0.344969 -0.786044 -0.786024 -0.243600 -0.201658 -0.299206 -0.299083 0.318894 0.242455 0.319482 0.237663 0.237777 0.285732 0.249784 0.249825 0.285722 0.237730 0.228153 0.228096
chargesum: 0.00000
title: Mulliken charges with hydrogens summed into heavy atoms:
elementType: O N N N N C C C C C C C C C C C C C C C C
charge: -0.197053 -0.085149 -0.067022 -0.037137 -0.037195 -0.091661 0.300348 0.223910 0.223740 0.083055 0.265356 0.143328 0.143296 -0.147712 -0.107306 -0.012752 -0.012746 -0.015447 0.026438 -0.299206 -0.299083
polarizability: 2.52123151e+02 8.43965881e-03 1.86638682e+02 1.89991534e+00 -1.14508832e-02 1.55470435e+02
1716.lowfreq: -4.6261 -3.5990 0.0002 0.0003 0.0004 5.5071 24.8034 47.4332 67.2118
frequency: 24.7291 47.4320 67.1996 80.6675 86.8947 99.5338 104.7092 111.3381 115.2176 159.6400 193.2040 213.4550 224.2014 277.8617 282.0285 297.7145 316.3210 343.0599 376.9148 417.3305 431.3273 456.4441 475.7097 476.4242 511.1967 519.1152 531.7415 543.6521 571.8263 577.3260 612.9546 628.1005 632.5229 660.9178 664.0618 671.9162 697.0796 750.6242 760.9385 847.7241 857.5773 880.8050 881.3819 907.5495 942.9629 967.0039 981.2966 1020.7330 1033.3463 1044.9827 1046.2839 1051.4782 1079.9015 1128.6698 1171.9215 1180.7477 1199.8318 1222.3560 1229.9840 1241.1918 1276.8940 1302.6729 1324.3683 1341.0187 1403.5798 1406.2907 1416.1113 1450.6363 1461.6894 1462.2048 1471.5962 1471.6792 1475.6628 1497.4296 1613.1908 1631.2643 1636.9335 1661.9354 1673.4782 2155.8842 2157.7572 2979.9492 2980.3948 3054.5728 3054.8327 3121.3488 3121.4721 3131.7261 3138.8789 3152.7297 3169.5383 3565.2854 3570.9089
redmass: 7.4112 5.5771 4.7125 2.0600 1.7556 1.6008 1.8046 5.4776 10.5202 6.5037 3.5706 7.1276 4.3087 2.8453 6.2947 8.2152 4.2065 7.0452 4.5896 4.7791 6.6686 3.6393 5.2929 8.8636 4.2315 2.1961 2.3918 4.1707 1.8916 4.5187 6.7892 3.8411 2.6794 5.9087 6.6491 6.5792 4.5750 2.1257 1.9071 5.7638 1.8043 3.3589 4.6708 8.0781 1.4335 1.7490 1.3234 2.1147 2.0948 1.5833 1.5051 2.6020 3.0944 2.1950 1.1122 3.1596 7.3123 11.1630 4.1879 1.9835 1.9766 1.9927 5.3927 2.0477 1.2333 1.2856 3.7676 1.3151 1.9422 1.2954 1.0440 1.0459 3.0163 1.8154 6.9434 7.2350 4.2600 8.2057 10.1823 12.6266 12.6181 1.0395 1.0395 1.0979 1.0979 1.0966 1.0965 1.0861 1.0899 1.0948 1.1003 1.0778 1.0794
irintensity: 10.7204 5.9244 0.0913 0.0434 0.4421 0.0059 0.3967 0.0000 4.1781 0.9848 2.3844 3.9880 0.7556 1.2769 0.3461 2.1226 1.8451 1.7763 0.0239 2.5207 2.2255 7.1190 0.0909 2.7484 12.8145 38.3600 32.9912 0.0849 26.8639 7.7953 4.8625 6.2639 26.3923 5.9044 1.6283 6.7772 30.6255 24.9786 62.2545 2.4346 3.1831 0.1933 5.3481 5.2977 1.5080 3.3550 0.1193 4.3516 9.9996 0.0064 5.5500 0.0070 13.1917 11.6643 2.5409 86.7970 2.5193 8.7477 26.7282 19.9353 7.3978 25.3447 11.4183 18.5404 46.7615 14.0932 2.3538 242.1375 22.6708 28.2368 0.4712 29.8946 61.3767 223.7907 3.8925 90.2546 31.4162 96.6089 359.5322 84.0965 25.3460 1.6711 42.8511 0.0004 21.6665 4.2699 2.5408 1.1702 5.6914 20.8440 23.9366 70.0166 43.1356
temp: 298.150 k
press: 1.00000 atm
elementType: 8 7 7 7 7 6 6 6 6 6 6 6 6 6 6 6 6 6 6 6 6 1 1 1 1 1 1 1 1 1 1 1 1
symmnumber: 1
zpe: 641587.0 jmol-1
zpe.correction: 0.244368 hartree
zpe.thermalcorrener: 0.263275 hartree
zpe.thermalcorrenthalpy: 0.264220 hartree
zpe.thermalcorrgfe: 0.196830 hartree
zpe.sumelectzpe: -909.683062 hartree
zpe.sumelectthermal: -909.664154 hartree
zpe.sumelectthermalent: -909.663210 hartree
zpe.sumelectthermalfe: -909.730600 hartree
dipole: 4.2829 -0.0023 -2.8737
dipole: 5.1577
quadrupole: -82.2402 -149.2891 -119.3226
quadrupole: -0.0211 -13.3091 -0.0030
quadrupole: 34.7104 -32.3385 -2.3720 -0.0211 -13.3091 -0.0030
hfenergy: -909.9274297 hartree
pointgroup: C01 [X(C16H12N4O1)]
dipole: 1.6668898 -0.0009102 -1.1571827 debye
polarizability: 252.1590872|0.0186276|186.6386791|0.3669543|-0.0186301|155.4345018 unknown
InChI: InChI=1S/C16H12N4O/c1-9-12(7-17)16(13(8-18)10(2)19-9)11-5-3-4-6-14(11)20-15(16)21/h3-6,19-20H,1-2H3
charge 0 multiplicity 1
33 atoms
O  0.754941 -0.001238 2.652003
N  -1.489884 -0.00048 1.889295
N  3.002403 -0.000426 -0.569524
N  -0.283574 -3.554619 -0.061805
N  -0.280138 3.556226 -0.061909
C  0.188025 0.000128 0.174843
C  -1.227575 0.000393 -0.40969
C  0.993938 -1.261369 -0.18687
C  0.994422 1.261303 -0.186873
C  -0.102608 0.0003 1.737147
C  -2.175051 -0.000015 0.64565
C  2.343335 -1.229128 -0.478347
C  2.343806 1.228526 -0.478346
C  -1.657328 0.00074 -1.743081
C  -3.558782 -0.000126 0.402782
C  3.19579 -2.447803 -0.735314
C  3.196738 2.44689 -0.735195
C  -3.050161 0.000754 -2.012436
C  -3.98401 0.000324 -0.94936
C  0.309344 -2.514459 -0.124585
C  0.310308 2.514653 -0.124567
H  -1.94054 -0.001212 2.804823
H  -0.92992 0.000999 -2.562477
H  4.004231 -0.000621 -0.760818
H  -4.287799 -0.000509 1.219796
H  3.673736 -2.400283 -1.732333
H  2.593739 -3.366713 -0.686658
H  3.998126 -2.528676 0.02301
H  3.998493 2.52791 0.023727
H  2.59486 3.365959 -0.68739
H  3.67545 2.398832 -1.73182
H  -3.406634 0.001048 -3.047553
H  -5.056682 0.000293 -1.172024
