program: Gaussian 09
title: 000278052
version: EM64L-G09RevD.01
frameworkgroup: C1[X(C13H6Cl3NO)]
method: RPBEPBE
basis: SDD
operation: Freq
keyword: #p
keyword: freq=noraman
keyword: PBEPBE/SDD
title: #p freq=noraman PBEPBE/SDD
converged: NO NO NO NO
title: Mulliken charges:
elementType: Cl Cl Cl O N C C C C C C C C C C C C C H H H H H H
charge: 0.002194 0.013512 -0.027484 -0.243455 -0.447421 0.301094 0.328003 0.311844 0.120844 -0.006420 -0.311880 -0.359162 -0.382658 -0.309815 -0.161632 -0.117526 -0.214520 -0.137944 0.340166 0.248012 0.231373 0.261597 0.301271 0.260006
chargesum: 0.00000
title: Mulliken charges with hydrogens summed into heavy atoms:
elementType: Cl Cl Cl O N C C C C C C C C C C C C C
charge: 0.002194 0.013512 -0.027484 -0.243455 -0.107254 0.301094 0.328003 0.311844 0.120844 -0.006420 -0.063868 -0.127789 -0.121062 -0.008543 -0.161632 -0.117526 0.045486 -0.137944
polarizability: 3.40036479e+02 -2.44367529e+00 1.91744111e+02 9.99212925e-03 -6.62782025e-03 6.40911301e+01
1716.lowfreq: -3.4363 -2.7501 0.0008 0.0023 0.0026 11.0742 39.6165 55.8243 103.1637
frequency: 39.6150 55.7501 103.1608 109.6863 150.4976 164.9814 178.8926 202.5710 224.9401 243.5891 303.8494 304.6325 341.6705 376.8524 384.1821 429.5389 456.2660 458.4256 484.8935 511.5943 526.7777 591.1698 622.7930 625.1713 657.5057 660.9204 697.2115 711.3431 736.7612 766.0398 784.9754 833.8581 837.0359 864.7328 881.6609 914.6043 937.2529 966.4003 1004.9323 1074.5263 1099.1205 1125.6685 1151.5290 1223.9894 1241.0815 1268.0671 1276.9617 1289.5725 1345.9275 1377.4023 1387.8196 1408.5333 1437.4391 1467.1382 1489.8444 1543.4601 1579.2574 1602.1827 1611.6995 1636.8384 3146.8732 3148.7415 3166.7310 3168.7086 3172.5943 3515.1921
redmass: 18.3830 8.7970 9.5735 16.1398 4.7323 7.8361 30.0725 13.7357 7.1802 18.5886 15.5338 5.5385 7.3209 5.1900 14.0388 3.3861 8.2831 4.0634 6.7650 8.8567 3.3545 8.0043 6.0922 6.1688 7.4963 2.5606 7.1680 2.6347 1.9639 7.7739 3.4197 1.6078 6.7562 1.6345 1.5412 5.3828 1.4294 1.3603 6.5405 1.8811 6.3594 2.0561 1.6647 2.1962 1.5713 2.2767 2.4338 1.8255 3.0763 7.3193 7.0960 5.1775 2.6012 3.5822 3.5088 7.9139 7.2652 6.8892 7.5871 5.6064 1.0881 1.0925 1.0952 1.0933 1.0921 1.0767
irintensity: 0.0122 1.9840 1.1419 0.3786 0.6735 1.8464 0.0212 0.9254 0.1619 0.8511 1.9843 0.5303 2.4283 0.1215 18.3676 11.0355 1.2559 7.9402 8.6729 33.4726 1.5763 6.7101 13.1646 6.2397 13.0965 21.0372 6.9126 4.4905 57.2660 17.1740 10.9040 39.0973 41.3187 34.5470 28.2232 19.9046 12.5844 0.8800 17.4680 13.0054 10.4203 75.2394 2.8592 2.4941 75.3852 36.7906 68.8874 16.9284 28.2735 89.8429 17.6119 3.6446 87.9722 114.8189 22.5635 7.6302 26.7745 50.4863 41.0362 414.8080 3.8344 1.4003 0.2533 4.7073 5.7322 43.3034
temp: 298.150 k
press: 1.00000 atm
elementType: 17 17 17 8 7 6 6 6 6 6 6 6 6 6 6 6 6 6 1 1 1 1 1 1
symmnumber: 1
zpe: 407350.2 jmol-1
zpe.correction: 0.155151 hartree
zpe.thermalcorrener: 0.169722 hartree
zpe.thermalcorrenthalpy: 0.170667 hartree
zpe.thermalcorrgfe: 0.112336 hartree
zpe.sumelectzpe: -2007.958114 hartree
zpe.sumelectthermal: -2007.943543 hartree
zpe.sumelectthermalent: -2007.942599 hartree
zpe.sumelectthermalfe: -2008.000930 hartree
dipole: 1.3023 -1.4578 0.0005
dipole: 1.9548
quadrupole: -142.1149 -119.5468 -126.4512
quadrupole: 14.7717 -0.0021 0.0008
quadrupole: -12.7440 9.8241 2.9198 14.7717 -0.0021 0.0008
hfenergy: -2008.1132656 hartree
pointgroup: C01 [X(C13H6Cl3N1O1)]
dipole: -0.5068686 -0.5784074 -0.0001787 debye
dipolederiv: -0.4066695 -0.2978505 -0.0000127 -0.4785305 -0.4594374 -0.0000157 0.0000048 0.0000034 -0.0206133 -0.9022914 0.1272543 -0.0000049 0.2244001 -0.0855103 -0.0000016 0.0000324 -0.0000104 -0.0194417 -1.0356518 0.1596371 -0.0000346 0.1338847 -0.1202897 0.0000009 -0.0000334 -0.0000007 -0.0500382 -0.8517153 -0.3729798 -0.0000177 -0.5279496 -1.1624916 -0.0000449 -0.0001691 -0.0001719 -0.3579592 -1.1684522 -0.6163496 -0.0001008 -0.0902151 -0.4965829 -0.0000102 -0.0000578 -0.0000316 -0.2972201 -0.0375177 -0.0300168 0.0000005 -0.1923295 -0.1307953 -0.0000124 0.0000024 -0.0000226 -0.0044418 0.4018745 0.0105889 0.0000097 -0.210471 0.0198361 -0.0000134 -0.0000274 0.0000215 0.0220755 0.364241 0.4788024 0.0000272 0.4541872 0.5441862 0.0000332 0.0000364 0.000038 0.0961614 0.0794403 0.1191066 0.0000169 0.0023209 -0.4430977 -0.0000341 -0.0000153 -0.000011 0.003528 1.498806 0.5172856 0.0000991 0.2506363 1.3647767 0.0000756 0.0002208 0.0001751 0.1979998 0.0696855 -0.1096867 0.0000089 0.0574994 -0.0657809 -0.0000006 0.0000181 0.0000038 -0.0706752 -0.1723991 0.0824048 0.0000138 0.1564197 0.0531227 0.0000285 0.0000114 0.0000287 -0.1359729 -0.3137899 -0.177143 -0.0000083 -0.0370763 -0.0610925 0.0000052 0.0000109 0.0000112 -0.1329516 -0.4333189 -0.0132994 -0.0000182 0.3406262 -0.0271426 0.0000113 0.0000093 -0.0000015 -0.0558607 0.0556946 0.6015193 0.0000036 0.9191217 0.5843943 0.000024 -0.0000026 -0.0000153 -0.0776937 1.1331142 -0.293331 -0.000008 -0.5989091 0.1312468 0.000001 -0.0000528 0.0000326 -0.0393434 -0.2352918 0.0248175 -0.0000068 -0.0328643 0.0975386 0.000017 -0.0000118 0.0000232 -0.0816628 1.4759424 -0.2158664 0.000057 -0.3396211 0.0250573 -0.0000065 0.0000452 0.0000011 -0.0828855 0.1150523 0.0021428 -0.0000039 -0.0102191 0.2037055 -0.0000094 -0.0000063 -0.0000224 0.3189593 0.0974405 0.0682455 0.0000008 0.0406922 -0.0073976 -0.0000015 -0.0000022 0.000005 0.1467467 0.0212407 -0.1051658 -0.000019 -0.0724062 -0.0069709 -0.0000172 -0.0000067 -0.0000252 0.1454975 0.0733752 -0.0057246 -0.0000018 0.0273766 -0.0371328 -0.000011 -0.0000006 -0.0000146 0.174163 0.106328 -0.0101878 -0.0000019 -0.078589 0.0903885 -0.0000064 -0.0000081 -0.0000001 0.161396 0.0648626 0.0557964 0.0000008 0.0620158 -0.0105305 -0.0000117 0.0000025 -0.0000164 0.1602327 unknown
polarizability: 339.9763991|3.8571093|191.8041902|0.0099285|0.0067228|64.0911301 unknown
InChI: InChI=1S/C13H6Cl3NO/c14-6-1-2-7-8-4-10(15)11(16)5-12(8)17-13(18)9(7)3-6/h1-5,17H
charge 0 multiplicity 1
24 atoms
Cl -4.113181 -2.509993 -0.000218
Cl -5.21329 0.589637 -0.000129
Cl 5.434439 -1.047936 0.000138
O  1.877124 3.060434 0.000303
N  -0.244306 2.113596 -0.000015
C  -0.643707 -0.300916 -0.00015
C  0.810786 -0.51331 -0.00008
C  -1.142301 1.039529 -0.000095
C  1.683337 0.622154 0.000042
C  1.161409 2.017337 0.000019
C  -1.591421 -1.357671 -0.000206
C  1.407201 -1.808478 -0.000124
C  -2.537164 1.291946 -0.000103
C  3.091913 0.463494 0.000133
C  -2.972645 -1.112653 -0.000217
C  -3.448939 0.225889 -0.000172
C  2.80122 -1.970273 -0.000047
C  3.638635 -0.825906 0.00008
H  -0.607497 3.071888 0.000051
H  -1.257739 -2.398709 -0.000201
H  0.783123 -2.707231 -0.000252
H  -2.912858 2.320791 -0.000041
H  3.716414 1.361912 0.000205
H  3.243444 -2.971531 -0.000118
