program: Gaussian 09
title: 000278050
version: EM64L-G09RevD.01
frameworkgroup: C1[X(C13H7ClN2O3)]
method: RPBEPBE
basis: SDD
operation: Freq
keyword: #p
keyword: freq=noraman
keyword: PBEPBE/SDD
title: #p freq=noraman PBEPBE/SDD
converged: NO NO NO NO
title: Mulliken charges:
elementType: Cl O O O N N C C C C C C C C C C C C C H H H H H H H
charge: -0.032889 -0.243243 -0.197200 -0.203148 -0.446987 0.021332 0.244801 0.361741 0.346194 0.112029 -0.009638 -0.332680 -0.566312 -0.307520 -0.337399 0.439293 -0.441787 -0.134674 -0.244829 0.345454 0.233970 0.292810 0.253150 0.287273 0.291332 0.268927
chargesum: 0.00000
title: Mulliken charges with hydrogens summed into heavy atoms:
elementType: Cl O O O N N C C C C C C C C C C C C C
charge: -0.032889 -0.243243 -0.197200 -0.203148 -0.101533 0.021332 0.244801 0.361741 0.346194 0.112029 -0.009638 -0.098710 -0.273502 -0.054370 -0.050125 0.439293 -0.150455 -0.134674 0.024099
polarizability: 3.26837140e+02 -8.30640436e+00 2.09978780e+02 -6.42851382e-03 2.26858134e-02 6.36651791e+01
1716.lowfreq: -15.1009 -10.5741 -6.6004 -0.0017 -0.0004 -0.0004 39.9976 55.0706 77.4898
frequency: 39.9089 55.0688 77.4877 103.8361 107.9612 146.4854 183.7579 230.2708 268.5418 271.3354 291.8626 320.3790 321.7308 381.6156 430.2965 444.4488 453.4720 483.4651 518.9818 544.5119 566.1564 583.3834 626.3849 638.3306 638.8068 696.7913 699.9641 704.5444 725.3480 754.7372 780.8745 784.1303 812.2788 844.9518 853.2039 882.0274 918.2938 938.5543 980.8667 995.8400 1008.5141 1075.8227 1090.5784 1099.8328 1132.0189 1147.6923 1210.3651 1239.2250 1254.1026 1270.9178 1292.8582 1307.1002 1356.6849 1382.4245 1391.7432 1410.0599 1428.9804 1450.2180 1481.9927 1501.9462 1556.9329 1598.8370 1603.8013 1625.8215 1636.9417 3158.5393 3164.2595 3166.9158 3183.7467 3185.9289 3194.4199 3515.0056
redmass: 10.7500 8.7571 6.0079 7.9274 14.6598 5.7185 11.8991 6.3440 5.1175 11.8956 12.6434 4.9491 8.2053 7.4060 3.2070 9.1565 3.3360 7.7694 7.5507 5.0857 7.2861 4.7077 6.1423 7.7067 2.2473 7.6464 4.5480 6.9433 2.0967 2.6680 9.4235 2.6261 6.2699 1.6042 1.5967 1.6755 1.5676 4.5585 1.3662 1.3466 6.1605 2.8910 2.0345 2.3786 1.9054 1.3385 5.1210 2.0937 1.6566 1.9402 3.0448 2.1854 2.5635 10.5127 8.4611 3.8253 6.7135 2.6908 3.8629 3.1185 8.2812 7.9787 6.5035 7.5246 5.5525 1.0901 1.0899 1.0923 1.0924 1.0952 1.0958 1.0768
irintensity: 0.2791 1.5073 0.0778 3.8211 1.5520 3.3649 3.2302 0.0322 2.0221 2.0842 0.0735 1.2779 0.0005 16.9202 10.0772 6.9786 0.2020 1.0738 1.0162 9.5666 10.8166 4.8002 0.5902 0.8060 1.0454 9.2263 5.1457 8.7921 43.5628 53.6529 50.8507 30.3025 34.9549 5.5264 48.2298 10.0108 49.9526 5.7047 1.7807 1.5612 24.9246 10.7966 51.1520 3.1197 28.1928 30.4885 395.2811 69.6179 28.7086 9.5491 65.7424 70.3185 3.4903 112.2201 73.4857 48.4596 5.0491 35.1908 43.8546 13.4003 6.9813 23.1156 107.0473 41.7553 406.2640 1.4299 3.9946 5.6506 1.4847 1.4147 3.2625 48.8014
temp: 298.150 k
press: 1.00000 atm
elementType: 17 8 8 8 7 7 6 6 6 6 6 6 6 6 6 6 6 6 6 1 1 1 1 1 1 1
symmnumber: 1
zpe: 461908.8 jmol-1
zpe.correction: 0.175932 hartree
zpe.thermalcorrener: 0.190555 hartree
zpe.thermalcorrenthalpy: 0.191500 hartree
zpe.thermalcorrgfe: 0.133068 hartree
zpe.sumelectzpe: -1293.486893 hartree
zpe.sumelectthermal: -1293.472269 hartree
zpe.sumelectthermalent: -1293.471325 hartree
zpe.sumelectthermalfe: -1293.529757 hartree
dipole: -3.1696 -1.0743 0.0017
dipole: 3.3467
quadrupole: -141.1856 -121.9424 -116.7616
quadrupole: 7.0030 0.0074 -0.0002
quadrupole: -14.5557 4.6874 9.8683 7.0030 0.0074 -0.0002
hfenergy: -1293.6628249 hartree
pointgroup: C01 [X(C13H7Cl1N2O3)]
dipole: 1.1919525 -0.5594437 -0.0006832 debye
dipolederiv: -0.4502822 0.3276547 -0.000073 0.51715 -0.6035407 0.0001172 -0.0001288 0.0001262 -0.0538324 -0.6711238 -0.2575997 0.0001209 -0.4341781 -1.2858631 0.0002878 -0.0002018 -0.000239 -0.3591565 -0.9007225 -0.2169521 0.0000618 -0.3370539 -0.6446902 -0.0000396 0.0003742 0.0003015 -0.2205749 -0.8698933 0.1657409 -0.0000028 0.3441365 -0.6469756 0.0001876 0.0002692 -0.0001437 -0.225405 -0.9699067 -0.6542231 -0.0000025 -0.2307172 -0.6488873 0.0000234 0.00013 0.0000761 -0.3010982 2.3166398 0.059149 -0.0002316 -0.046082 1.0674555 -0.0001577 -0.0004505 -0.00017 0.1839321 0.3305435 0.0313788 -0.0000043 -0.1637582 -0.1415738 0.0000331 0.0000271 -0.0000131 -0.0023868 0.2237148 0.0152142 -0.0000183 -0.2248589 0.1911938 -0.0000539 -0.0000456 0.000033 0.0314096 -0.1236115 0.5198326 -0.0000275 0.6600674 0.684354 -0.0001201 -0.0000916 -0.0000858 0.115068 -0.0715671 0.2093837 -0.0000302 0.1459516 -0.4848842 0.0000617 -0.0000732 0.0001016 0.0019504 1.3380084 0.4275271 -0.0000933 0.2557604 1.52137 -0.0002761 0.0002383 0.0000448 0.2008325 -0.1008273 -0.0959062 0.0000042 -0.059012 0.1134694 0.0000002 -0.0000107 -0.0000491 -0.1016236 0.2442535 -0.3113969 0.0000088 0.2411438 -0.1381535 -0.0000294 -0.0002236 0.0000913 -0.1558724 -0.4736095 0.2383463 -0.0000523 0.2361928 -0.178376 0.0000191 -0.0000858 0.0000384 -0.1006721 -0.0316602 -0.1516768 0.0000443 0.2116825 0.1051909 -0.0000531 -0.0000345 -0.0000235 -0.087253 -0.9952876 0.0108452 0.0001592 -0.2134175 0.175455 0.0000129 0.0001582 -0.0000032 0.0810282 -0.0347054 0.0793661 -0.0000206 -0.105001 -0.1204557 0.0000105 -0.0001612 -0.0000528 -0.1437218 0.744004 -0.5270816 0.0001315 -0.8015348 0.9732288 -0.0002095 0.0002081 -0.0002244 -0.0505387 -0.0784707 0.1415293 -0.0000095 0.0818362 -0.3855543 0.0000688 -0.0000094 0.0000718 -0.1057764 0.1196238 -0.013099 0.0000301 -0.0354933 0.2123071 0.0000136 0.0000091 -0.0000079 0.3200311 0.0541183 0.0946291 0.0000009 0.075233 -0.0140939 0.000013 0.0000337 0.0000327 0.1378782 0.1336281 0.0276191 -0.0000026 0.005597 0.0348477 0.000018 0.0000308 0.0000074 0.1829486 0.0930771 -0.0754387 0.0000101 -0.0494654 0.0033779 0.0000268 0.0000461 0.0000233 0.1527283 0.0988393 0.0029276 0.0000003 -0.0695352 0.0376128 0.0000255 -0.0000016 0.0000274 0.1550986 0.0972412 -0.0477568 0.0000087 -0.0143201 0.0702052 0.0000111 0.000013 0.0000417 0.1790376 -0.022024 -0.0000127 -0.0000119 0.0096766 0.1029799 0.000009 -0.0000193 -0.0000047 0.1659689 unknown
polarizability: 327.2219324|-4.8869349|209.5939876|-0.008925|-0.0218247|63.6651791 unknown
InChI: InChI=1S/C13H7ClN2O3/c14-7-1-3-10-11(5-7)9-4-2-8(16(18)19)6-12(9)15-13(10)17/h1-6,15H
charge 0 multiplicity 1
26 atoms
Cl 4.542497 -2.897918 0.00057
O  1.748968 3.365433 -0.000297
O  -5.051457 -1.499989 0.00088
O  -5.037583 0.781036 0.000499
N  -0.171113 2.064607 -0.000437
N  -4.441355 -0.363791 0.000085
C  -0.135551 -0.385715 -0.000137
C  1.336364 -0.330999 -0.000124
C  -0.866597 0.848742 -0.000235
C  1.993272 0.940964 -0.000326
C  1.227255 2.211832 -0.000726
C  -0.877644 -1.598428 0.000047
C  -2.282071 0.854297 -0.000135
C  2.14315 -1.504985 0.000132
C  3.407002 1.025903 -0.000216
C  -2.959505 -0.373699 0.00011
C  -2.278678 -1.612721 0.000128
C  3.537264 -1.384471 0.000211
C  4.19629 -0.134023 0.000044
H  -0.700479 2.942342 -0.000429
H  -0.349691 -2.555422 0.000144
H  -2.857561 1.784803 -0.000194
H  1.695754 -2.500737 0.000296
H  3.861165 2.022074 -0.000385
H  -2.8510 -2.542768 0.000285
H  5.287605 -0.080469 0.00011
