program: Gaussian 09
title: 000278049
version: EM64L-G09RevD.01
frameworkgroup: C1[X(C13H7ClN2O3)]
method: RPBEPBE
basis: SDD
operation: Freq
keyword: #p
keyword: freq=noraman
keyword: PBEPBE/SDD
title: #p freq=noraman PBEPBE/SDD
converged: NO YES NO NO
title: Mulliken charges:
elementType: Cl O O O N N C C C C C C C C C C C C C H H H H H H H
charge: 0.057048 -0.238814 -0.215802 -0.181143 -0.439382 0.012862 0.329379 0.311727 0.312385 0.115706 -0.568060 -0.005734 -0.395577 -0.361309 0.565565 -0.342068 -0.388070 -0.232295 -0.233910 0.286830 0.342954 0.267609 0.237299 0.280760 0.239230 0.242811
chargesum: 0.00000
title: Mulliken charges with hydrogens summed into heavy atoms:
elementType: Cl O O O N N C C C C C C C C C C C C C
charge: 0.057048 -0.238814 -0.215802 -0.181143 -0.096428 0.012862 0.329379 0.311727 0.312385 0.115706 -0.281230 -0.005734 -0.127968 -0.124010 0.565565 -0.061308 -0.388070 0.006934 0.008901
polarizability: 3.21378965e+02 -2.69773893e-01 2.09856649e+02 -2.80673787e-02 -1.58790361e-02 6.38080953e+01
1716.lowfreq: -24.8703 -2.8188 -2.3775 0.0015 0.0018 0.0020 8.6235 42.6114 69.1718
frequency: -24.8188 42.6011 69.1705 124.3704 134.8731 146.2554 199.2399 210.1567 255.8880 264.6686 294.6904 315.2601 351.1620 360.9619 426.6260 447.3745 461.1980 478.0962 521.2297 524.2879 576.0835 598.9442 622.5740 650.3585 651.0058 690.3225 702.5616 723.3528 732.0397 743.4002 752.5680 789.1398 797.9427 836.2156 868.8280 898.9867 930.0422 944.8081 984.4420 1011.8494 1017.5159 1041.7525 1087.8051 1114.8858 1134.4442 1181.2528 1188.4653 1231.0285 1245.2953 1283.0177 1290.6155 1301.1098 1343.1676 1377.6260 1393.3846 1409.5210 1440.6166 1452.0481 1480.9833 1498.4332 1555.3525 1582.6008 1610.5555 1622.7548 1632.9678 3139.7766 3151.8492 3155.6778 3162.3777 3175.1538 3184.6400 3510.3922
redmass: 16.3833 10.5126 6.7672 5.9598 8.0116 4.8912 7.5103 20.6673 9.7885 4.7059 13.2345 8.4438 14.2624 6.3596 3.4375 3.2553 7.9436 7.9558 8.1033 3.6142 9.4020 6.9701 6.0518 6.9840 2.2904 6.9367 8.2081 2.9496 7.7759 1.5291 8.4823 1.9260 2.5885 5.8389 1.6133 1.5289 6.2098 1.4729 1.3785 1.3466 5.9009 2.4034 3.1799 2.2083 2.1663 1.1301 8.6204 2.2371 1.3484 2.7324 2.5638 1.9633 3.3530 6.0071 7.9319 7.9336 3.1782 2.5683 3.4473 3.7047 7.1437 6.6888 6.7890 6.8349 5.6383 1.0861 1.0895 1.0924 1.0952 1.1007 1.0899 1.0768
irintensity: 0.0320 3.1040 1.3553 2.6030 2.2110 0.2296 0.5652 0.0311 1.1003 3.1434 1.4707 11.9489 0.7320 1.3143 4.8983 7.2659 6.2114 0.5673 1.2017 0.0075 18.2874 1.5592 15.2353 7.5655 1.9314 0.8371 4.1680 0.3595 3.5419 129.1682 16.0162 46.8636 1.2047 12.8387 40.6808 0.2515 28.0526 20.9717 3.2069 0.2513 38.5629 7.7727 11.0642 8.9503 71.4449 27.7778 515.1560 1.8568 22.5932 107.5305 57.4039 51.8658 25.9900 58.5847 48.5609 9.6972 15.0922 70.4344 11.8055 31.6593 52.2482 14.5111 36.7428 222.8554 365.1235 1.7186 6.3983 0.7194 7.8380 21.9616 3.2936 51.7448
temp: 298.150 k
press: 1.00000 atm
elementType: 17 8 8 8 7 7 6 6 6 6 6 6 6 6 6 6 6 6 6 1 1 1 1 1 1 1
symmnumber: 1
zpe: 461343.7 jmol-1
zpe.correction: 0.175717 hartree
zpe.thermalcorrener: 0.189446 hartree
zpe.thermalcorrenthalpy: 0.190390 hartree
zpe.thermalcorrgfe: 0.134611 hartree
zpe.sumelectzpe: -1293.475307 hartree
zpe.sumelectthermal: -1293.461578 hartree
zpe.sumelectthermalent: -1293.460634 hartree
zpe.sumelectthermalfe: -1293.516413 hartree
dipole: 3.7362 -0.6819 -0.0014
dipole: 3.7980
quadrupole: -133.2110 -113.5510 -116.8324
quadrupole: 26.2487 0.0153 0.0087
quadrupole: -12.0129 7.6471 4.3657 26.2487 0.0153 0.0087
hfenergy: -1293.6510237 hartree
pointgroup: C01 [X(C13H7Cl1N2O3)]
dipole: 1.4840798 0.173877 0.000539 debye
dipolederiv: -0.5804211 0.3130603 0.0003642 0.3896337 -0.2479304 -0.0001058 0.0006192 -0.0001822 0.0040377 -1.0958575 -0.40199 0.000029 -0.5104048 -0.927233 0.0000203 0.0000721 0.0000366 -0.3546766 -0.4842368 -0.0180898 -0.0006732 -0.2777717 -0.9353034 0.0015391 -0.0002781 0.0011452 -0.2340377 -1.0376474 -0.0877713 -0.0015475 -0.0250092 -0.3985127 0.0005952 -0.0019346 0.0005131 -0.2057664 -1.6181284 -0.4663599 0.0000656 -0.0410937 -0.3979605 -0.0000336 0.0000245 -0.0000094 -0.2877926 1.785991 0.4815632 0.0027327 0.711625 1.4587247 -0.0024361 0.0024089 -0.0017758 0.1891078 -0.11601 -0.2257836 0.0000176 -0.5050387 -0.3002205 -0.000029 0.0001688 -0.0000052 0.0073714 0.302631 0.0312841 -0.0000187 -0.2721393 0.1441593 0.000002 -0.0000549 -0.0000694 0.0188591 0.9486812 0.4745208 -0.0000665 0.5934972 0.496389 0.0000394 -0.0000273 0.0001189 0.1072529 -0.0233925 0.0094915 0.0000007 -0.0607838 -0.5156071 0.0000083 -0.0000195 -0.0000081 0.003565 0.5372926 0.2910597 -0.0000569 0.0931134 -0.038476 -0.000089 0.0006822 0.0004204 -0.0962319 1.8586921 0.4133042 -0.0000784 -0.0006894 1.173259 -0.0000066 -0.0001263 -0.000042 0.2043912 -0.7636359 -0.1386768 0.000147 0.0104676 -0.0033376 -0.0000219 0.0001609 -0.0001138 -0.1226775 -0.1864448 0.1659886 0.000006 0.2799895 -0.0896589 -0.0000015 0.000007 -0.0000228 -0.133293 -1.0278776 -0.317848 -0.000374 -0.3059658 -0.530463 0.000202 -0.0002156 -0.0000875 0.086772 -0.0331534 -0.0323453 -0.0000061 0.2788323 0.023276 -0.000016 -0.0000038 0.0000107 -0.0979707 1.0011945 -0.4023542 -0.0006169 -0.1949515 0.6708572 0.0004271 -0.0013114 0.0001565 -0.0717019 0.0966253 -0.0152034 -0.0000095 -0.0424111 0.2015753 -0.0000093 0.000002 -0.0000137 -0.1237474 0.0459228 -0.0638078 -0.0000051 -0.1893359 -0.1219097 0.000007 -0.0000096 0.0000025 -0.1523336 0.1584123 0.0302677 0.0000446 0.0620647 0.0583588 -0.0000597 -0.0002619 -0.0000558 0.1520694 0.1083249 0.0141825 0.0000042 0.0534214 0.219343 0.000001 -0.0000073 -0.0000014 0.3179984 0.0720265 -0.0208609 0.0000101 -0.0030002 -0.0257563 -0.0000356 0.0000874 -0.0000434 0.1699424 -0.0039504 -0.1090517 0.0000126 -0.0706512 0.0469365 -0.0000026 0.0000007 0.0000178 0.146739 0.0603053 -0.021953 0.0000043 -0.102712 0.0689379 0.0000053 0.0000094 0.0000038 0.155627 0.0799325 0.0264025 0.0000048 0.0600107 -0.0948322 0.0000025 -0.0000008 0.0000068 0.1556529 -0.0852761 0.0709705 0.0000095 0.0693028 0.0653846 -0.0000022 0.0000079 -0.0000018 0.160843 unknown
polarizability: 320.9586063|-6.8392543|210.2770077|0.0269961|-0.0176389|63.8080953 unknown
InChI: InChI=1S/C13H7ClN2O3/c14-10-6-11-9(5-12(10)16(18)19)7-3-1-2-4-8(7)13(17)15-11/h1-6,15H
charge 0 multiplicity 1
26 atoms
Cl -4.141909 1.961463 0.000836
O  3.279188 2.586706 -0.000221
O  -3.220981 -2.559028 0.002606
O  -4.740098 -0.865042 -0.004451
N  1.000173 2.162423 -0.000063
N  -3.529085 -1.299582 -0.000454
C  0.055311 -0.08907 -0.000014
C  1.42251 -0.639132 -0.000078
C  -0.12001 1.33412 0.000005
C  2.536848 0.26013 -0.000153
C  -1.108509 -0.883636 -0.000004
C  2.345415 1.731467 -0.000141
C  -1.418695 1.901493 0.000152
C  1.691582 -2.03681 -0.000079
C  -2.405603 -0.327665 -0.000115
C  3.866547 -0.231474 -0.0002
C  -2.561129 1.088616 0.000062
C  3.012747 -2.516454 -0.000131
C  4.10898 -1.614469 -0.000198
H  -1.055977 -1.974548 0.000042
H  0.876866 3.180221 -0.000074
H  -1.541063 2.989201 0.000387
H  0.868703 -2.757618 -0.000016
H  4.682367 0.498566 -0.000244
H  3.195092 -3.59631 -0.000111
H  5.134833 -1.996067 -0.000244
