program: Gaussian 09
title: 000278068
version: EM64L-G09RevD.01
frameworkgroup: C1[X(C14H9NO5S)]
method: RPBEPBE
basis: SDD
operation: Freq
keyword: #p
keyword: freq=noraman
keyword: PBEPBE/SDD
title: #p freq=noraman PBEPBE/SDD
converged: YES YES NO NO
title: Mulliken charges:
elementType: S O O O O O N C C C C C C C C C C C C C C H H H H H H H H H
charge: 0.921811 -0.235723 -0.145893 -0.196970 -0.510087 -0.492866 -0.148780 0.177947 0.199648 0.136419 0.166005 -0.338235 -0.342905 -0.062167 -0.204532 -0.205051 -0.216182 -0.250216 -0.221952 -0.201773 -0.210371 0.272960 0.271047 0.244096 0.243463 0.323442 0.295641 0.246020 0.245461 0.239743
chargesum: 0.00000
title: Mulliken charges with hydrogens summed into heavy atoms:
elementType: S O O O O O N C C C C C C C C C C C C C C
charge: 0.921811 -0.235723 -0.145893 -0.196970 -0.510087 -0.492866 -0.148780 0.177947 0.199648 0.136419 0.166005 -0.065275 -0.071858 -0.062167 0.039564 0.038412 0.107260 0.045426 0.024068 0.043688 0.029371
polarizability: 3.75630256e+02 7.51787593e+00 2.14742841e+02 6.13586842e+00 -1.33433516e+00 1.02853456e+02
1716.lowfreq: -4.7727 -1.6532 -0.0012 -0.0010 0.0015 2.3448 23.9840 37.2337 50.8719
frequency: 23.9699 37.2253 50.8415 55.8355 72.0740 112.5150 125.3176 138.9026 146.2417 175.5127 183.1023 238.4438 242.5531 266.9587 303.7523 321.2374 325.4162 376.7190 400.6922 403.8752 416.3095 430.1653 449.2136 491.1622 504.7196 508.5289 566.5045 599.7965 649.1057 651.6310 683.3860 688.6204 693.6707 697.7750 758.6699 777.6090 792.3067 797.7750 849.0902 855.1691 908.2558 925.9983 940.5380 961.7657 968.9110 977.2866 987.7440 996.9017 1004.2233 1006.1527 1010.0459 1021.0282 1041.2301 1080.9851 1083.0420 1172.9895 1173.7676 1175.6165 1188.7348 1220.8541 1236.8947 1285.8384 1315.0342 1382.2215 1415.2098 1437.3409 1454.1732 1454.8233 1455.2751 1569.6216 1597.8948 1607.8334 1614.9206 1654.7091 1698.8857 3133.1769 3141.3485 3144.0044 3154.9393 3157.1860 3166.0865 3168.8161 3175.7186 3178.2148
redmass: 6.7194 5.8580 5.4197 7.4574 8.4313 9.3577 9.1480 6.2539 8.8050 6.8079 6.7190 7.0203 8.4660 11.7181 8.3951 12.3464 12.4014 10.0122 3.7943 2.9330 10.1085 6.6848 4.8553 4.8316 9.6457 7.6795 13.8321 6.4924 5.8101 5.8710 2.6256 5.2682 7.5039 4.6242 1.3442 4.9550 1.6660 8.4381 1.2476 7.4035 1.3990 18.5940 1.3397 9.4399 6.0737 1.4079 1.3991 10.1394 3.5956 1.4998 1.3574 2.0282 1.9849 2.7117 1.5864 1.1713 1.0736 1.8755 1.1292 3.9169 10.6099 1.5060 1.2800 8.3149 6.4140 2.2627 1.9357 2.7511 2.4653 5.6442 6.7922 7.4911 7.3465 12.8557 12.8890 1.0911 1.0881 1.0867 1.0914 1.0908 1.0960 1.0957 1.1012 1.1005
irintensity: 2.3917 1.3210 1.5481 0.8463 0.1848 1.3332 7.1683 1.5070 5.3430 4.4490 0.5569 4.6897 14.5181 13.3384 5.1244 10.7954 2.5268 10.4409 3.5216 0.1709 66.0053 15.0890 2.2582 61.2288 9.2184 9.7522 27.3864 1.0936 0.3262 1.7473 21.0042 28.3248 7.6336 33.0532 82.4385 0.7847 83.1315 27.9900 0.3099 35.2230 0.0682 55.0402 4.4161 87.1584 3.7000 1.9943 0.5111 47.9681 0.4449 0.8218 0.0016 5.5401 22.1893 0.4521 7.1023 36.2029 1.0598 0.9167 36.8294 49.8623 706.1272 0.5273 2.6505 6.5614 18.7331 21.8893 22.8924 3.9491 15.1391 3.4571 3.1160 0.0841 12.7871 364.2292 68.2107 35.2081 5.3229 1.6915 4.6751 4.6949 3.3863 3.4420 41.0509 21.7699
temp: 298.150 k
press: 1.00000 atm
elementType: 16 8 8 8 8 8 7 6 6 6 6 6 6 6 6 6 6 6 6 6 6 1 1 1 1 1 1 1 1 1
symmnumber: 1
zpe: 528202.9 jmol-1
zpe.correction: 0.201182 hartree
zpe.thermalcorrener: 0.219525 hartree
zpe.thermalcorrenthalpy: 0.220469 hartree
zpe.thermalcorrgfe: 0.153136 hartree
zpe.sumelectzpe: -1366.168409 hartree
zpe.sumelectthermal: -1366.150066 hartree
zpe.sumelectthermalent: -1366.149122 hartree
zpe.sumelectthermalfe: -1366.216455 hartree
dipole: -1.2428 -5.2578 -0.3469
dipole: 5.4138
quadrupole: -70.7505 -133.2634 -135.5592
quadrupole: -0.0059 5.7158 0.3824
quadrupole: 42.4406 -20.0724 -22.3682 -0.0059 5.7158 0.3824
hfenergy: -1366.3695909 hartree
pointgroup: C01 [X(C14H9N1O5S1)]
dipole: 0.4552714 -2.0010338 -0.5704147 debye
polarizability: 375.3446993|-11.6000822|201.5366103|2.3612994|36.5114144|116.3452443 unknown
InChI: InChI=1S/C8H4NO3.C6H5O2S/c10-7-5-3-1-2-4-6(5)8(11)9(7)12;7-9(8)6-4-2-1-3-5-6/h1-4H;1-5H
charge 0 multiplicity 1
30 atoms
S  -1.545556 1.319977 0.89094
O  -0.391149 1.562755 -0.954506
O  1.950525 3.003566 0.053748
O  0.287887 -1.273784 -1.165376
O  -0.476135 0.324247 1.628253
O  -2.059719 2.674487 1.631569
N  0.811928 1.022521 -0.697976
C  3.021077 0.755478 -0.00002
C  2.521028 -0.522954 -0.363893
C  1.952356 1.78014 -0.167445
C  1.099604 -0.402521 -0.787728
C  4.340936 0.922568 0.447031
C  3.32666 -1.669914 -0.290387
C  -3.061382 0.372306 0.279101
C  5.160845 -0.231957 0.524845
C  4.661202 -1.509073 0.161308
C  -2.86465 -0.83499 -0.410319
C  -4.315133 0.945091 0.552885
C  -4.025446 -1.525519 -0.831562
C  -5.457046 0.232418 0.120593
C  -5.311032 -0.996272 -0.565944
H  4.713852 1.91204 0.728583
H  2.929423 -2.650467 -0.56965
H  6.194801 -0.139538 0.87338
H  5.317375 -2.382677 0.234547
H  -1.860561 -1.215096 -0.630353
H  -4.391229 1.898099 1.085541
H  -3.917687 -2.470545 -1.373374
H  -6.453328 0.639648 0.320836
H  -6.201449 -1.539533 -0.900127
