program: Gaussian 09
title: 000278121
version: EM64L-G09RevD.01
frameworkgroup: C1[X(C16H22O4S)]
method: RPBEPBE
basis: SDD
operation: Freq
keyword: #p
keyword: freq=noraman
keyword: PBEPBE/SDD
title: #p freq=noraman PBEPBE/SDD
converged: YES YES NO NO
title: Mulliken charges:
elementType: S O O O O C C C C C C C C C C C C C C C C H H H H H H H H H H H H H H H H H H H H H H
charge: 0.191948 -0.353981 -0.290776 -0.446746 -0.236499 -0.227356 -0.530071 -0.441028 -0.351759 -0.393401 -0.393214 0.648815 -0.530529 -0.523887 -0.730844 0.218796 -0.331358 0.218568 0.285578 -0.509097 -0.536094 0.222996 0.274091 0.218667 0.208972 0.213147 0.209902 0.192068 0.205425 0.194080 0.204635 0.266365 0.233240 0.274716 0.273748 0.235798 0.219322 0.253008 0.255914 0.414444 0.222699 0.228353 0.241342
chargesum: 0.00000
title: Mulliken charges with hydrogens summed into heavy atoms:
elementType: S O O O O C C C C C C C C C C C C C C C C
charge: 0.191948 -0.353981 -0.290776 -0.032302 -0.236499 -0.004359 -0.255980 -0.013389 0.071290 0.004092 0.005502 0.648815 -0.264163 -0.290647 -0.182380 0.218796 -0.095560 0.218568 0.285578 0.219148 0.156300
polarizability: 2.57658831e+02 -1.15508879e+01 1.83680498e+02 5.23746156e+00 1.24825927e+01 1.65064016e+02
1716.lowfreq: -7.6956 -0.0017 -0.0016 0.0012 0.6661 10.9509 26.1502 45.0157 58.6570
frequency: 25.9622 44.8844 58.5721 62.6425 75.7989 93.0276 107.4718 125.5087 133.7276 144.4085 152.5539 185.0138 185.6666 197.2034 217.7971 232.5101 247.2372 255.2738 295.8850 304.9950 318.5321 321.2302 356.7092 399.8508 407.6451 416.1225 439.4338 471.9750 472.6609 481.5621 532.0940 556.9717 611.2518 615.5372 623.2264 698.8883 700.7807 721.7636 732.4388 737.9307 790.3598 796.5882 832.4167 837.0841 850.6168 868.6674 877.9103 890.1266 910.8334 913.3632 928.6897 945.0690 965.5131 986.8656 1019.4286 1040.9596 1057.0483 1082.9412 1096.2527 1105.4535 1108.6075 1111.1890 1120.5192 1122.4417 1143.3173 1160.9985 1175.9767 1196.2407 1200.7267 1210.6610 1213.3588 1228.8691 1234.4792 1249.7164 1260.6456 1275.5114 1289.4930 1301.9201 1322.8770 1325.4845 1334.9284 1341.2424 1348.6802 1362.1511 1388.1872 1412.3648 1424.5515 1434.9660 1444.0044 1454.1126 1456.2610 1457.1648 1464.8954 1466.8167 1470.8185 1471.6115 1475.2762 1504.3223 1587.5720 1623.9613 1642.7481 2960.9617 2964.0079 2967.9368 2969.1586 2974.1349 2979.3984 3003.8559 3026.5862 3030.2356 3033.8952 3041.5142 3050.0361 3052.4777 3055.9334 3115.2430 3122.7147 3130.5744 3137.8290 3139.7267 3145.8230 3160.5704 3164.2552
redmass: 4.0957 5.7583 5.2079 3.7471 3.0221 4.2282 4.4235 4.5449 4.5539 5.2517 2.1979 2.3683 2.9035 3.8502 3.0835 3.5262 2.3432 1.6613 2.5976 3.6613 2.4325 4.3659 3.8760 2.9246 2.7702 4.3904 3.2084 2.7462 3.0888 3.6507 6.0130 3.8630 5.0834 5.9707 4.6478 3.2547 5.2620 3.4136 6.3849 3.4373 1.9139 1.5701 2.0613 2.0601 2.2759 1.7587 2.1269 1.8725 2.3276 1.4703 1.3928 2.2274 2.8581 8.2323 3.2399 1.9362 1.4581 1.6941 2.2868 2.3717 2.1909 1.2580 1.9307 1.2440 1.5000 1.4123 1.4654 1.4980 1.3678 1.3431 1.4718 1.2233 1.5548 2.5342 1.4207 1.2884 1.3181 1.5065 1.2828 1.3172 1.4178 1.5139 1.6973 1.5711 4.9477 2.1842 1.1288 1.1726 1.3021 1.0560 1.0908 1.0891 1.0825 1.0506 1.0955 1.0532 1.0806 2.6961 7.3850 6.6721 7.5551 1.0327 1.0766 1.0631 1.0631 1.0676 1.0633 1.0294 1.0883 1.0947 1.0990 1.1017 1.1041 1.0999 1.0575 1.1051 1.0995 1.0889 1.0846 1.1027 1.0928 1.0921 1.0928
irintensity: 1.0190 2.5600 2.5758 4.6241 1.2461 7.8218 3.9127 7.4291 0.2969 1.9414 3.3527 5.4569 1.5063 0.7765 0.4364 0.8049 2.4540 3.2601 2.1426 2.6927 2.4321 1.4575 3.9138 4.2963 2.9903 1.7335 6.0093 2.3129 4.8545 0.1743 9.9789 3.1685 9.1180 16.2962 9.8364 10.7542 9.9722 2.9803 1.8251 2.4731 2.9917 40.3622 110.5145 10.0288 34.5928 51.6527 8.4932 7.2892 5.1487 56.5792 45.8858 5.8876 25.6966 37.2195 61.1253 0.9658 4.0723 70.9176 98.6779 27.8483 33.3861 0.1798 2.3516 0.2239 5.6011 18.7782 10.6741 9.7451 41.8425 39.6029 17.1946 20.2453 43.0613 128.5799 14.9129 0.7879 2.9535 14.3342 7.8638 0.1940 0.7088 0.5113 12.5094 13.6485 7.2814 15.4894 22.7753 0.6760 17.0488 21.3810 5.1382 9.9634 14.6228 13.7445 9.0739 23.9888 56.6611 132.3255 27.0250 6.2390 208.1663 70.0947 8.1936 41.7202 31.1090 28.4768 21.9967 55.1856 24.2661 64.3148 36.8948 26.7170 41.7837 68.1583 8.6030 25.4582 27.3021 8.1447 275.9432 75.2512 59.9125 14.3336 1.5874
temp: 298.150 k
press: 1.00000 atm
elementType: 16 8 8 8 8 6 6 6 6 6 6 6 6 6 6 6 6 6 6 6 6 1 1 1 1 1 1 1 1 1 1 1 1 1 1 1 1 1 1 1 1 1 1
symmnumber: 1
zpe: 924746.1 jmol-1
zpe.correction: 0.352217 hartree
zpe.thermalcorrener: 0.373766 hartree
zpe.thermalcorrenthalpy: 0.374710 hartree
zpe.thermalcorrgfe: 0.301756 hartree
zpe.sumelectzpe: -1320.229581 hartree
zpe.sumelectthermal: -1320.208032 hartree
zpe.sumelectthermalent: -1320.207088 hartree
zpe.sumelectthermalfe: -1320.280042 hartree
dipole: -0.4946 -2.1935 0.3299
dipole: 2.2726
quadrupole: -110.2217 -129.3594 -135.0184
quadrupole: 4.8715 4.5377 8.7403
quadrupole: 14.6448 -4.4929 -10.1519 4.8715 4.5377 8.7403
hfenergy: -1320.5817985 hartree
pointgroup: C01 [X(C16H22O4S1)]
dipole: 0.6530884 -0.5162003 0.3262558 debye
polarizability: 214.2498356|46.238296|210.2960475|3.3246932|-15.9443227|181.8574613 unknown
InChI: InChI=1S/C16H22O4S/c1-19-13-8-7-11(9-14(13)20-2)12-5-3-4-6-15(12)21-10-16(17)18/h7-9,12,15,17H,3-6,10H2,1-2H3
charge 0 multiplicity 1
43 atoms
S  -2.511003 0.525913 0.687799
O  1.953454 0.862217 -2.119143
O  3.700149 1.655036 0.1250
O  -0.822253 1.063239 -2.448546
O  -0.541831 2.86686 -1.006743
C  -0.878842 -1.833739 0.802559
C  -2.099578 -1.239769 0.034156
C  -0.622803 -3.294451 0.309146
C  -3.3536 -2.131411 0.152505
C  -1.876497 -4.188326 0.433152
C  -3.070036 -3.575152 -0.332728
C  0.374511 -0.973541 0.670787
C  0.795164 -0.543728 -0.606377
C  1.113132 -0.532089 1.790262
C  -2.621534 1.538183 -0.925527
C  1.828642 0.395611 -0.78083
C  2.228585 0.317851 1.625877
C  2.602695 0.799602 0.347649
C  -1.2458 1.921584 -1.435434
C  2.641482 2.145884 -2.41014
C  4.434733 2.127855 1.30004
H  -1.15399 -1.887625 1.877277
H  -1.836479 -1.091926 -1.029566
H  0.220575 -3.719639 0.885919
H  -0.295243 -3.260772 -0.750254
H  -4.182069 -1.68131 -0.425823
H  -3.681594 -2.154789 1.211341
H  -2.146545 -4.299568 1.503764
H  -1.654229 -5.203775 0.051923
H  -2.84123 -3.561482 -1.418408
H  -3.977028 -4.196395 -0.203472
H  0.261418 -0.870858 -1.502239
H  0.809165 -0.832028 2.799648
H  -3.180614 2.440875 -0.635339
H  -3.182637 0.958756 -1.673158
H  2.794718 0.628714 2.508906
H  2.481582 2.297177 -3.489667
H  3.712566 2.071557 -2.178045
H  2.175605 2.961685 -1.831553
H  0.18239 1.134841 -2.580697
H  4.909329 1.287158 1.84257
H  3.774588 2.690851 1.987723
H  5.212355 2.795722 0.900583
