program: Gaussian 09
title: 000278044
version: EM64L-G09RevD.01
frameworkgroup: C1[X(C13H8Cl2N2O)]
method: RPBEPBE
basis: SDD
operation: Freq
keyword: #p
keyword: freq=noraman
keyword: PBEPBE/SDD
title: #p freq=noraman PBEPBE/SDD
converged: NO NO NO NO
title: Mulliken charges:
elementType: Cl Cl O N N C C C C C C C C C C C C C H H H H H H H H
charge: -0.061130 -0.047973 -0.258546 -0.450513 -0.689614 0.285329 0.331776 0.350656 0.112120 -0.019139 -0.373594 -0.621745 -0.365546 -0.316692 0.713010 -0.467761 -0.221437 -0.128337 0.332166 0.242705 0.228106 0.227926 0.299716 0.256448 0.316190 0.325880
chargesum: 0.00000
title: Mulliken charges with hydrogens summed into heavy atoms:
elementType: Cl Cl O N N C C C C C C C C C C C C C
charge: -0.061130 -0.047973 -0.258546 -0.118347 -0.047545 0.285329 0.331776 0.350656 0.112120 -0.019139 -0.130889 -0.393639 -0.137620 -0.016976 0.713010 -0.467761 0.035011 -0.128337
polarizability: 3.45241113e+02 -2.67909029e+00 1.92643694e+02 -3.04857383e-02 1.14227155e-02 6.54845423e+01
1716.lowfreq: -5.0192 -0.0023 -0.0015 -0.0010 4.0281 9.4629 50.5375 57.8976 113.6860
frequency: 50.5141 57.8645 113.6846 118.7838 152.7325 167.6990 197.0442 246.8651 264.2729 284.5409 302.5664 302.6307 341.2133 374.4125 417.6731 428.6827 432.6881 450.7397 477.4308 488.2130 502.6306 512.1918 527.8852 617.6788 630.9265 650.3724 677.4172 696.7141 713.6859 718.8479 739.8454 783.1841 794.8933 827.6970 837.2451 856.0303 877.0288 935.6827 961.8861 982.5236 1007.1641 1055.1989 1075.3745 1097.4621 1152.8419 1215.5930 1235.4648 1256.9355 1284.2784 1289.6825 1343.2670 1367.3099 1384.9612 1401.6389 1423.8625 1460.2621 1479.4499 1530.4791 1546.3336 1580.3982 1605.0034 1622.2891 1629.8840 1648.0461 3123.9221 3147.7874 3166.4213 3168.9581 3173.4917 3514.8395 3548.2724 3695.3075
redmass: 7.4510 8.5794 14.8239 6.5675 4.8384 7.7869 14.3485 5.5151 7.6321 5.8572 13.0042 5.4284 7.2921 2.9805 1.3034 7.2656 3.0800 3.2863 6.6022 1.2101 4.9685 8.4038 3.3082 5.2801 7.7099 2.6240 6.6578 7.3195 2.0701 6.1996 1.8421 3.5272 6.8087 1.5929 6.1161 2.0873 1.5699 1.4182 1.3583 2.9614 6.0653 1.5982 1.7822 5.7454 1.5456 1.5083 1.9160 1.6850 3.0484 1.7478 5.2142 2.4287 6.6273 3.8210 6.0691 3.0676 4.4317 4.4998 7.3399 6.9931 6.6934 2.3688 2.4769 2.9649 1.0915 1.0879 1.0929 1.0948 1.0930 1.0764 1.0457 1.1036
irintensity: 1.3330 2.9128 0.0848 0.1932 0.5629 3.3118 1.1618 2.7295 2.3922 0.8861 3.5235 0.0819 2.4002 18.9970 69.1087 19.9257 16.0290 65.5672 9.6826 137.2677 4.0763 33.4289 3.0116 8.9294 2.9539 28.8247 0.0027 4.5103 9.5757 12.2863 46.7290 8.2378 34.2780 25.3107 38.9778 99.3149 11.1364 12.5198 1.1219 5.2313 28.9100 13.9730 4.0196 26.9251 4.5429 10.9793 9.3012 10.4944 77.6984 43.8717 142.2765 6.3684 43.6745 12.6709 8.5104 242.5601 46.2131 50.6897 14.1426 12.7899 79.3676 155.6713 235.0852 576.1347 14.2457 5.0480 2.1946 2.5971 7.7626 32.1878 161.0268 38.2447
temp: 298.150 k
press: 1.00000 atm
elementType: 17 17 8 7 7 6 6 6 6 6 6 6 6 6 6 6 6 6 1 1 1 1 1 1 1 1
symmnumber: 1
zpe: 476991.8 jmol-1
zpe.correction: 0.181677 hartree
zpe.thermalcorrener: 0.196366 hartree
zpe.thermalcorrenthalpy: 0.197311 hartree
zpe.thermalcorrgfe: 0.139652 hartree
zpe.sumelectzpe: -1603.855564 hartree
zpe.sumelectthermal: -1603.840874 hartree
zpe.sumelectthermalent: -1603.839930 hartree
zpe.sumelectthermalfe: -1603.897589 hartree
dipole: -6.4607 -0.3605 -0.0095
dipole: 6.4708
quadrupole: -110.7402 -113.4058 -122.2753
quadrupole: -20.7392 0.0602 -0.0130
quadrupole: 4.7335 2.0680 -6.8015 -20.7392 0.0602 -0.0130
hfenergy: -1604.0372406 hartree
pointgroup: C01 [X(C13H8Cl2N2O1)]
dipole: -2.5350826 -0.2334045 -0.0037456 debye
dipolederiv: -0.5333831 -0.2996473 -0.0002629 -0.4612298 -0.4876093 -0.0002569 -0.0003858 -0.0003596 -0.0570519 -1.0513555 0.1682297 0.0000595 0.1426633 -0.1353195 -0.0000017 0.0000123 0.0000033 -0.0643662 -0.8412356 -0.3738803 0.0000771 -0.5471266 -1.1873666 0.0001352 0.0000821 0.0000284 -0.3675912 -1.1327008 -0.5252366 0.0000445 -0.0932703 -0.4306939 0.0000296 0.0000372 0.0001771 -0.2974299 -1.9579053 0.2223986 0.0020707 0.3745156 -0.1855872 -0.0013384 0.008278 -0.002186 -0.6908337 -0.6524656 -0.0262207 0.0002909 -0.0913151 -0.2856154 0.0000118 0.0001327 -0.0002361 -0.0545256 0.9039601 -0.0179969 -0.0001337 -0.2739778 0.0005981 -0.0000202 0.00004 0.0000645 0.0319753 0.7435947 0.2097439 -0.0002554 0.2307263 0.6151836 0.0000477 -0.0001761 0.0000788 0.1267827 -0.0902791 0.1868448 0.0000057 -0.1532442 -0.4742779 0.0000728 -0.0000408 0.0000215 -0.0041028 1.4081532 0.4457628 -0.0001888 0.3164706 1.3951152 -0.0001801 -0.0002866 -0.0001308 0.1882135 0.4632587 0.0794399 -0.00034 0.0670704 -0.0227214 -0.0000573 -0.0002927 -0.0000179 -0.0443877 -0.6384399 0.0375598 0.0002527 -0.3854493 0.0115016 0.0003218 0.0002295 0.0001453 -0.2774398 -0.2933493 0.0667098 -0.0000114 0.28387 0.0592904 -0.0000854 -0.0000657 -0.0000641 -0.1480656 -0.3459596 -0.0741059 0.0000183 0.2793236 0.0077777 -0.0000223 -0.0000299 0.0000346 -0.058756 1.8104581 -0.3649497 -0.0019932 -0.649915 0.0343156 0.0004661 -0.0028105 0.0004894 0.1829871 -0.0557894 0.4256881 0.000707 1.3355116 0.5653574 0.0003521 0.0001554 0.0005897 -0.1587743 -0.1322752 0.067714 -0.0000077 0.0308087 0.1056792 -0.0000508 0.000023 -0.0000653 -0.0872282 1.3961532 -0.2204773 -0.0000615 -0.3558495 -0.0283289 0.0000142 -0.0000005 -0.0000082 -0.0891428 0.1099569 0.0111815 0.0000457 -0.0029146 0.1803918 -0.000023 0.0000693 -0.0000104 0.31392 0.1257377 0.0643908 0.0000277 0.0358453 -0.0179111 -0.000082 0.0001116 -0.0000771 0.1452384 0.0152717 0.0256418 0.0000538 0.0629726 -0.0988891 -0.0001076 0.0002858 -0.0001627 0.1850401 0.0122628 -0.1086183 0.0000398 -0.0687229 -0.0162413 0.0000392 0.0000141 0.0000589 0.1454193 0.1050674 -0.0134549 0.0000057 -0.0833808 0.0910037 0.000013 0.0000125 -0.0000012 0.1616297 0.0662591 0.0587411 -0.0000044 0.0667641 -0.0187052 0.0000279 -0.0000074 0.0000373 0.1601962 0.2546055 -0.0374311 -0.0001032 -0.1137681 0.1339956 0.0007625 -0.0031113 0.0016939 0.3835021 0.3103991 -0.0080277 -0.0003367 0.053622 0.1890569 -0.0000681 -0.0022763 -0.0001034 0.3747911 unknown
polarizability: 345.2358036|2.8262588|192.6490033|-0.0308778|0.0103161|65.4845423 unknown
InChI: InChI=1S/C13H8Cl2N2O/c14-6-1-2-7-8-4-10(15)11(16)5-12(8)17-13(18)9(7)3-6/h1-5,17H,16H2
charge 0 multiplicity 1
26 atoms
Cl -4.183128 -2.4437 -0.000979
Cl 5.42159 -1.083112 -0.000196
O  1.883701 3.05043 -0.000274
N  -0.240834 2.115944 0.000177
N  -4.858619 0.522003 0.002202
C  -0.657139 -0.290172 0.000003
C  0.792183 -0.512931 -0.000035
C  -1.155752 1.053079 0.00028
C  1.676912 0.615145 -0.000188
C  1.158768 2.007145 -0.000158
C  -1.619097 -1.336985 -0.000206
C  -2.542145 1.326593 0.000629
C  1.382626 -1.812085 0.000157
C  3.085022 0.448268 -0.00025
C  -3.495885 0.277134 0.000639
C  -2.98439 -1.059718 0.00003
C  2.77569 -1.984078 0.000086
C  3.615675 -0.844237 -0.000141
H  -0.592367 3.078448 0.000441
H  -1.300708 -2.382507 -0.000739
H  -2.893563 2.365701 0.001281
H  0.75301 -2.706789 0.000436
H  3.713772 1.34387 -0.000361
H  3.211918 -2.987534 0.00025
H  -5.219373 1.471336 -0.002369
H  -5.512865 -0.257646 0.000185
