program: Gaussian 09
title: 000278087
version: EM64L-G09RevD.01
frameworkgroup: C1[X(C19H36)]
method: RPBEPBE
basis: SDD
operation: Freq
keyword: #p
keyword: freq=noraman
keyword: PBEPBE/SDD
title: #p freq=noraman PBEPBE/SDD
converged: YES YES NO NO
title: Mulliken charges:
elementType: C C C C C C C C C C C C C C C C C C C H H H H H H H H H H H H H H H H H H H H H H H H H H H H H H H H H H H H
charge: -0.073597 0.007066 0.043095 -0.590849 -0.596248 -0.539074 -0.505569 0.011567 -0.471685 -0.488999 -0.457970 -0.346686 -0.387935 -0.356344 -0.374029 -0.354185 -0.698235 -0.357444 -0.696746 0.220218 0.201611 0.203438 0.201250 0.218946 0.217023 0.206196 0.196459 0.205476 0.210277 0.199022 0.183212 0.198078 0.196255 0.196921 0.199562 0.210714 0.191516 0.206878 0.183994 0.187413 0.200949 0.193009 0.194294 0.189798 0.188008 0.187604 0.187792 0.214748 0.209608 0.209415 0.194858 0.195128 0.214846 0.209742 0.209612
chargesum: 0.00000
title: Mulliken charges with hydrogens summed into heavy atoms:
elementType: C C C C C C C C C C C C C C C C C C C
charge: 0.146621 0.208676 0.246533 -0.170654 -0.173029 -0.137139 -0.096271 0.194779 -0.077352 -0.092516 -0.055739 0.044185 0.000427 0.030959 0.003777 0.021210 -0.064463 0.032542 -0.062547
polarizability: 2.40052439e+02 -3.24238659e+00 1.94985082e+02 -1.58850986e+00 -3.31832432e+00 1.69207658e+02
1716.lowfreq: -0.0008 0.0007 0.0012 6.1215 13.3758 15.3588 26.7854 31.4189 42.2694
frequency: 20.5624 30.6400 41.8881 47.8615 54.9743 65.4777 76.0337 98.6485 108.9975 123.8923 131.4144 146.7963 165.2532 187.1028 206.4960 223.3949 227.0670 231.0196 259.1334 270.5472 307.3376 332.5448 360.0643 377.9433 421.3953 435.7223 456.7887 462.0570 474.9881 496.0962 523.5143 615.9389 650.3350 721.9523 728.9555 736.4093 759.4495 779.7654 785.2518 811.2406 826.1833 845.2181 876.9214 880.9566 888.2300 890.6905 897.9074 918.4630 929.2296 955.8274 968.6165 976.0413 1003.2751 1009.5888 1020.8774 1025.0347 1035.8362 1052.7305 1056.5992 1062.5887 1070.8994 1076.5795 1079.8035 1089.7615 1099.4177 1101.7802 1110.3497 1114.9509 1129.2833 1143.4070 1152.4285 1177.2428 1189.5537 1193.5449 1210.7423 1218.8593 1228.3076 1238.1904 1245.4603 1250.2733 1259.0209 1268.9495 1269.7564 1277.6194 1280.3391 1286.3197 1288.0478 1289.4305 1293.7442 1295.5171 1297.2984 1304.5141 1306.2247 1321.3987 1328.0684 1337.0103 1341.3671 1345.8948 1346.0726 1351.6764 1355.9267 1356.4084 1358.9195 1363.2507 1386.7660 1387.1090 1458.0422 1461.3935 1462.2293 1464.8176 1466.2412 1467.8754 1468.6822 1471.0453 1473.6305 1474.8392 1475.8422 1476.2723 1477.1342 1478.4987 1482.7008 1486.8492 1488.5432 2914.7492 2936.4975 2943.5141 2945.7091 2949.3470 2950.8659 2954.9145 2955.0962 2957.6297 2960.6503 2960.8054 2963.8067 2965.5920 2966.7748 2967.7867 2970.7704 2971.1216 2971.6014 2980.6513 2984.8483 2992.7889 2995.4740 3006.8347 3007.5467 3013.7768 3020.0433 3024.8321 3026.3490 3033.2191 3038.6797 3039.6668 3046.4948 3067.6034 3067.6848 3069.6949 3069.7367
redmass: 3.7485 3.2143 1.8569 2.1580 2.2815 2.8033 2.5579 2.3515 1.7832 2.7240 2.5030 2.1847 2.1988 2.7565 3.1516 1.1398 1.1712 2.4824 3.3501 2.6003 2.4999 2.4137 2.3066 2.3028 2.8540 2.3663 2.7401 2.6766 2.5112 2.2339 3.6920 2.9468 1.9884 1.0699 1.0848 1.1444 2.1245 1.2999 1.4204 2.2460 2.0434 1.7673 1.7193 1.5739 1.6543 1.8028 1.5234 1.9102 1.5803 1.4346 1.8122 1.5934 3.2048 2.9819 2.0913 1.3884 2.8947 1.7976 2.1358 1.6260 1.7734 1.9879 1.8920 2.1473 1.7478 1.6650 2.1974 2.0503 2.1692 2.1558 1.9399 1.5012 1.6959 1.6221 1.6502 1.4404 1.2724 1.3644 1.3069 1.3191 1.3233 1.3104 1.2896 1.2426 1.2223 1.0471 1.1245 1.2773 1.3332 1.1320 1.2532 1.2507 1.3696 1.3571 1.4034 1.4783 1.4330 1.5130 1.4342 1.6425 1.6260 1.6654 1.5951 1.5738 1.2187 1.2171 1.0783 1.0751 1.0705 1.0848 1.0703 1.0781 1.0853 1.0923 1.0822 1.0760 1.0493 1.0429 1.0694 1.0894 1.0843 1.0829 1.0909 1.0800 1.0812 1.0762 1.0599 1.0590 1.0595 1.0604 1.0604 1.0622 1.0692 1.0609 1.0709 1.0638 1.0619 1.0594 1.0367 1.0402 1.0660 1.0680 1.0959 1.0943 1.0971 1.1013 1.1009 1.0987 1.0983 1.1033 1.1029 1.1034 1.1018 1.1035 1.0994 1.1007 1.1006 1.0993 1.0993
irintensity: 0.0007 0.0046 0.0031 0.0024 0.0089 0.0018 0.0060 0.0016 0.0030 0.0349 0.0335 0.0135 0.0387 0.0142 0.0102 0.0007 0.0137 0.1634 0.0117 0.0298 0.0378 0.3985 0.0565 0.0551 0.4346 0.2850 0.0594 0.1134 0.2298 0.0983 0.9287 1.0187 6.1470 12.0342 8.4576 0.4281 0.9470 0.2501 2.2286 0.3842 2.0494 0.3448 3.4525 2.5280 4.4700 0.9134 10.0819 1.8916 1.5678 6.0225 0.5349 0.9965 0.6052 1.0587 5.4537 0.3390 0.7315 0.2367 0.9112 2.7732 1.2782 0.5569 0.6186 0.1754 0.4313 5.7827 1.3745 11.4560 1.3382 1.0035 0.5608 2.3584 0.0760 0.4095 2.4623 0.1685 9.8325 1.2290 0.9921 1.2177 1.3105 2.2357 0.1790 0.9962 0.2192 0.3031 1.6853 1.5073 0.5455 1.5241 0.1034 1.2157 0.5915 4.2653 0.2568 1.2081 1.4171 0.1876 2.0703 1.1330 1.7766 1.9125 0.3869 5.6007 10.4499 11.0236 1.3454 1.5158 0.0180 5.6093 0.1811 2.0265 1.1934 7.7604 20.8275 1.1845 15.5670 12.3991 0.3553 3.3866 1.7282 15.7637 23.1356 4.5914 9.6181 19.0746 9.4147 0.0661 1.3095 6.8534 1.2298 8.3132 20.4381 14.6246 3.4769 63.0986 90.6121 192.9617 41.5352 40.5407 69.8208 38.3652 3.7299 14.5058 10.5780 8.7298 13.0158 50.8760 30.9271 35.5812 37.5684 79.4783 51.5717 129.2973 128.9644 64.6367 122.9473 95.1912 19.2382
temp: 298.150 k
press: 1.00000 atm
elementType: 6 6 6 6 6 6 6 6 6 6 6 6 6 6 6 6 6 6 6 1 1 1 1 1 1 1 1 1 1 1 1 1 1 1 1 1 1 1 1 1 1 1 1 1 1 1 1 1 1 1 1 1 1 1 1
symmnumber: 1
zpe: 1335158.4 jmol-1
zpe.correction: 0.508535 hartree
zpe.thermalcorrener: 0.530785 hartree
zpe.thermalcorrenthalpy: 0.531729 hartree
zpe.thermalcorrgfe: 0.455066 hartree
zpe.sumelectzpe: -744.060303 hartree
zpe.sumelectthermal: -744.038053 hartree
zpe.sumelectthermalent: -744.037108 hartree
zpe.sumelectthermalfe: -744.113772 hartree
dipole: -0.1239 0.0975 -0.0110
dipole: 0.1580
quadrupole: -124.5455 -124.1239 -122.5713
quadrupole: -0.3178 -0.1113 1.5470
quadrupole: -0.7986 -0.3770 1.1756 -0.3178 -0.1113 1.5470
hfenergy: -744.5688377 hartree
pointgroup: C01[X(C19H36)]
dipole: 0.0487825 -0.0381663 -0.0052984 debye
polarizability: 240.0840409|-3.1427159|194.8483426|1.0529437|3.7858842|169.312795 unknown
InChI: InChI=1S/C19H36/c1-3-5-7-8-10-16-11-12-18-14-17(9-6-4-2)15-19(18)13-16/h16-19H,3-15H2,1-2H3
charge 0 multiplicity 1
55 atoms
C  -0.689726 -0.431249 0.116465
C  -1.365726 -1.765681 -0.284299
C  -2.863348 0.114299 -0.911652
C  -1.901257 0.515291 0.264222
C  -2.39381 -1.325222 -1.354359
C  0.2465 -0.621324 1.323873
C  -0.320276 -2.835923 -0.645092
C  1.324209 -1.714663 1.038063
C  0.646077 -3.033281 0.555698
C  -4.360467 0.167913 -0.522206
C  2.433324 -1.247815 0.052078
C  -4.850532 1.572628 -0.102843
C  3.304166 -0.083184 0.577428
C  -6.350193 1.608478 0.270168
C  4.504129 0.242667 -0.341289
C  5.360676 1.421987 0.172263
C  -6.830852 3.010294 0.704692
C  6.570943 1.74394 -0.73416
C  7.417089 2.925271 -0.211835
H  -0.089184 -0.086586 -0.754627
H  -1.925282 -2.125505 0.609998
H  -2.709392 0.820603 -1.75342
H  -2.398117 0.326866 1.239392
H  -1.623957 1.58497 0.239579
H  -1.906533 -1.288011 -2.348862
H  -3.247468 -2.024543 -1.435364
H  -0.362048 -0.93727 2.197853
H  0.731658 0.332538 1.608557
H  0.241946 -2.517517 -1.547109
H  -0.805729 -3.799791 -0.896721
H  1.835072 -1.93902 1.999906
H  0.064484 -3.462111 1.398699
H  1.427868 -3.776175 0.299182
H  -4.541733 -0.547423 0.308594
H  -4.973024 -0.18511 -1.378401
H  1.992783 -0.959771 -0.923395
H  3.094675 -2.115382 -0.156238
H  -4.2535 1.932276 0.759882
H  -4.661476 2.287965 -0.931353
H  3.680212 -0.337661 1.591203
H  2.68634 0.82985 0.695671
H  -6.950023 1.261638 -0.596191
H  -6.538247 0.882362 1.08765
H  4.133424 0.475641 -1.361799
H  5.143582 -0.659346 -0.442338
H  5.722832 1.19359 1.196814
H  4.722683 2.326097 0.264031
H  -7.90556 3.009416 0.964755
H  -6.67913 3.749506 -0.1046
H  -6.268906 3.363933 1.589899
H  6.208708 1.970581 -1.757907
H  7.208897 0.840883 -0.823596
H  8.273709 3.137982 -0.877758
H  7.818146 2.709664 0.796707
H  6.808164 3.84633 -0.139111
