program: Gaussian 09
title: 000278046
version: EM64L-G09RevD.01
frameworkgroup: C1[X(C15H11ClN2O2)]
method: RPBEPBE
basis: SDD
operation: Freq
keyword: #p
keyword: freq=noraman
keyword: PBEPBE/SDD
title: #p freq=noraman PBEPBE/SDD
converged: NO YES NO NO
title: Mulliken charges:
elementType: Cl O O N N C C C C C C C C C C C C C C C H H H H H H H H H H H
charge: -0.041682 -0.257913 -0.255632 -0.433256 -0.451519 0.316436 0.320518 0.286266 0.115728 -0.644767 -0.017870 0.519102 -0.398081 -0.362833 -0.378661 -0.318079 -0.226060 -0.125674 0.213131 -0.800634 0.210937 0.335178 0.234590 0.224837 0.317674 0.302422 0.257589 0.310461 0.237919 0.271923 0.237950
chargesum: 0.00000
title: Mulliken charges with hydrogens summed into heavy atoms:
elementType: Cl O O N N C C C C C C C C C C C C C C C
charge: -0.041682 -0.257913 -0.255632 -0.098078 -0.141059 0.316436 0.320518 0.286266 0.115728 -0.433830 -0.017870 0.519102 -0.163491 -0.137995 -0.060987 -0.015657 0.031529 -0.125674 0.213131 -0.052842
polarizability: 3.65777807e+02 -2.54530259e+00 2.11866689e+02 7.01578952e-04 8.62807481e-05 7.72742143e+01
1716.lowfreq: -63.4045 -0.0006 0.0003 0.0017 0.8220 4.3819 10.3859 38.5661 53.2615
frequency: -63.3945 38.5623 53.2273 68.3442 89.8792 105.4189 148.4403 165.9735 166.1524 210.6783 214.2462 275.5806 310.0410 311.5184 339.7456 381.1584 385.9882 423.9089 455.7837 457.3958 491.2478 501.4423 516.8078 558.2323 577.7264 606.8033 612.0384 643.0271 644.6701 660.0094 682.4520 729.0281 739.8046 741.4659 783.9818 793.0712 829.0787 850.1624 850.9267 879.5870 890.0437 937.6790 942.2523 960.4629 986.9379 988.0929 1027.0043 1032.3508 1072.8762 1099.0356 1139.9356 1159.4863 1209.3135 1232.6627 1246.9049 1256.9295 1280.5569 1293.4950 1326.0313 1357.8432 1378.9635 1384.0090 1405.3419 1416.1152 1430.7029 1449.8786 1469.2003 1473.2151 1502.3921 1526.5635 1555.7151 1594.6373 1605.2840 1624.9809 1633.5263 1638.7787 2988.6509 3073.8276 3126.4511 3133.4212 3139.0425 3149.0720 3168.8533 3173.2496 3198.2452 3514.2575 3522.8301
redmass: 1.0736 7.2419 4.9435 7.2899 6.4489 3.8544 5.6330 7.9975 5.7832 11.9760 5.0393 5.0572 10.1826 5.0503 7.1515 4.9703 4.5320 3.1871 5.9389 3.8661 7.5685 6.5789 3.1369 5.2777 3.1835 5.8829 2.2012 7.2869 1.5225 2.3340 6.5263 2.1569 6.0680 2.2881 3.1346 6.2498 1.6451 1.5171 4.8258 1.8437 5.1652 1.4185 6.2350 1.3638 1.7980 1.3193 2.8498 1.6503 1.8549 5.7883 1.7694 1.2773 2.6187 1.7828 1.7281 1.5529 2.2387 2.7548 2.2945 3.3423 1.2389 7.8538 4.6881 3.5839 2.8893 1.2120 1.0464 2.3266 3.6688 2.3646 7.0264 6.4207 6.7163 5.8663 5.0948 5.9586 1.0385 1.0984 1.0903 1.0912 1.0978 1.0873 1.0927 1.0967 1.0950 1.0765 1.0764
irintensity: 0.0089 4.7961 1.8961 3.6252 3.0574 5.3927 0.0197 4.0989 0.2406 1.8547 3.3462 3.1612 2.4140 0.0307 4.2041 6.2010 0.0005 5.8960 20.4483 4.9500 22.6545 7.0165 0.0656 2.3980 5.4619 5.8117 56.0430 0.6573 23.7781 28.2255 15.0718 30.3176 5.0200 25.9971 8.5539 33.6580 37.6847 76.4935 17.0755 34.6179 1.5560 12.7341 6.5037 1.5126 40.7313 2.2871 0.1264 7.8995 3.8312 16.7620 19.2475 2.6680 19.7682 47.3820 90.0137 20.3367 2.3971 78.8208 151.0514 113.8180 55.9863 89.6632 28.6666 42.3455 179.9383 5.8913 20.4987 42.5111 261.7996 287.8991 7.9789 0.3491 165.4255 336.9281 178.9035 29.4780 8.0281 14.6857 13.8651 9.1348 7.3356 9.3175 2.8492 9.0094 14.3408 40.2325 9.4960
temp: 298.150 k
press: 1.00000 atm
elementType: 17 8 8 7 7 6 6 6 6 6 6 6 6 6 6 6 6 6 6 6 1 1 1 1 1 1 1 1 1 1 1
symmnumber: 1
zpe: 598196.9 jmol-1
zpe.correction: 0.227841 hartree
zpe.thermalcorrener: 0.243877 hartree
zpe.thermalcorrenthalpy: 0.244821 hartree
zpe.thermalcorrgfe: 0.183449 hartree
zpe.sumelectzpe: -1296.893783 hartree
zpe.sumelectthermal: -1296.877748 hartree
zpe.sumelectthermalent: -1296.876804 hartree
zpe.sumelectthermalfe: -1296.938176 hartree
dipole: -3.7559 -5.0006 0.0003
dipole: 6.2540
quadrupole: -147.1570 -109.2418 -126.2386
quadrupole: 7.3965 -0.0027 -0.0004
quadrupole: -19.6112 18.3040 1.3072 7.3965 -0.0027 -0.0004
hfenergy: -1297.1216246 hartree
pointgroup: C01 [X(C15H11Cl1N2O2)]
dipole: -1.5599844 -1.9027804 -0.0006267 debye
polarizability: 365.2833696|-9.0735885|212.3610564|-0.0771786|0.0843928|77.2742848 unknown
InChI: InChI=1S/C15H11ClN2O2/c1-8(19)17-10-3-5-14-12(7-10)11-4-2-9(16)6-13(11)15(20)18-14/h2-7,17-18H,1H3
charge 0 multiplicity 1
31 atoms
Cl 5.718156 -2.009018 -0.00255
O  3.185066 2.791113 0.001048
O  -5.441886 0.406907 0.001598
N  0.903447 2.352034 0.001309
N  -3.609569 -1.064656 0.000356
C  -0.042651 0.092145 0.000127
C  1.329483 -0.442496 -0.000543
C  -0.220921 1.511075 0.00106
C  2.437561 0.465247 -0.000238
C  -1.204354 -0.720986 -0.000081
C  2.241879 1.940537 0.000724
C  -2.503947 -0.166939 0.0006
C  -1.524538 2.067594 0.001729
C  1.621124 -1.838007 -0.001487
C  -2.66311 1.250205 0.001511
C  3.774806 -0.00559 -0.000845
C  2.942594 -2.312416 -0.002096
C  4.00968 -1.383068 -0.001762
C  -4.978405 -0.770561 0.000823
C  -5.870748 -2.012509 0.000489
H  -1.095903 -1.811997 -0.000784
H  0.762941 3.367187 0.00198
H  -1.646612 3.15722 0.002431
H  0.811195 -2.573342 -0.001759
H  -3.667954 1.674725 0.002016
H  4.583837 0.730952 -0.000573
H  3.149563 -3.386579 -0.00282
H  -3.368023 -2.058735 -0.00022
H  -5.691575 -2.635497 -0.895476
H  -6.920829 -1.688272 0.000626
H  -5.691508 -2.635975 0.89611
