program: Gaussian 09
title: 000278043
version: EM64L-G09RevD.01
frameworkgroup: C1[X(C13H8Cl2N2O)]
method: RPBEPBE
basis: SDD
operation: Freq
keyword: #p
keyword: freq=noraman
keyword: PBEPBE/SDD
title: #p freq=noraman PBEPBE/SDD
converged: NO YES NO NO
title: Mulliken charges:
elementType: Cl Cl O N N C C C C C C C C C C C C C H H H H H H H H
charge: -0.050288 -0.044352 -0.261662 -0.438828 -0.698823 0.333731 0.314279 0.297097 0.118184 -0.588300 -0.016693 -0.448773 -0.361543 0.703182 -0.318096 -0.415811 -0.224869 -0.124463 0.216089 0.334379 0.255784 0.226333 0.302091 0.257196 0.312102 0.322055
chargesum: 0.00000
title: Mulliken charges with hydrogens summed into heavy atoms:
elementType: Cl Cl O N N C C C C C C C C C C C C C
charge: -0.050288 -0.044352 -0.261662 -0.104449 -0.064666 0.333731 0.314279 0.297097 0.118184 -0.372212 -0.016693 -0.192988 -0.135210 0.703182 -0.016005 -0.415811 0.032327 -0.124463
polarizability: 3.40664289e+02 -9.85015416e+00 1.91274858e+02 -4.82738255e-02 -8.11399777e-03 6.54066095e+01
1716.lowfreq: -7.4008 -2.2166 -1.0201 -0.0005 0.0004 0.0005 41.3292 63.8024 103.9120
frequency: 41.3220 63.7960 103.9102 119.3802 151.9602 185.8224 205.4736 225.5074 226.8582 279.5994 314.4217 333.0013 359.9517 370.7260 379.0512 391.8761 423.5075 436.2591 458.6043 491.5722 500.0804 522.8363 528.0699 596.7010 645.1192 645.4615 664.1694 681.5668 712.5399 724.4484 730.1449 780.0073 794.6825 826.9509 857.2866 866.2036 868.6437 933.6951 936.2439 958.5138 1029.3355 1053.1550 1073.9812 1099.7325 1151.2789 1224.6266 1235.6703 1251.8735 1277.9331 1296.1156 1314.1404 1379.5758 1384.4277 1412.1570 1417.8762 1442.8630 1486.1674 1510.6178 1555.1766 1583.2148 1604.3000 1622.4107 1628.3327 1650.6386 3142.5990 3152.4440 3154.2605 3170.0940 3174.2284 3519.8015 3559.1535 3704.1865
redmass: 13.9430 5.2379 9.5183 12.4419 5.2444 5.4550 13.2302 6.3209 12.0514 5.3236 4.8249 8.2771 1.1980 6.8844 12.1749 3.5113 2.6253 1.8800 2.0139 6.6705 4.5072 3.2427 7.7090 6.0172 2.8072 6.8760 3.7580 7.2586 2.3486 6.7200 1.9790 3.4887 7.2144 1.6071 1.5299 2.1153 4.4950 6.7402 1.4238 1.3679 2.9022 1.5219 1.8075 6.0100 1.5940 1.5543 1.8724 1.9902 2.4584 1.9425 2.4911 4.6386 7.2719 3.9853 5.3688 3.1666 3.7037 4.3550 7.9550 7.0542 6.3831 2.0982 2.4478 3.5944 1.0906 1.0876 1.0922 1.0929 1.0968 1.0765 1.0454 1.1037
irintensity: 0.0912 0.1040 0.4176 0.5342 0.1963 6.4129 1.2400 3.6853 0.3851 4.3226 0.0290 4.2714 100.8684 6.2638 13.2186 0.6051 74.5616 116.7216 25.2000 1.0925 3.6015 2.9606 28.0798 14.7237 22.3243 4.5117 9.5475 32.5455 8.2656 7.8340 50.1133 11.2517 25.4183 46.0855 43.0361 25.5076 34.8073 4.9840 13.2456 1.4360 66.1264 3.8924 17.3090 4.8651 11.8795 24.0391 32.1553 67.4173 16.8415 36.8723 6.2331 28.2293 61.6676 55.8385 12.7440 68.0156 85.5482 168.7946 4.8921 42.3099 150.0087 12.5896 533.3235 85.2847 5.1130 11.1408 0.4079 2.5182 10.4235 39.0878 117.3577 31.6168
temp: 298.150 k
press: 1.00000 atm
elementType: 17 17 8 7 7 6 6 6 6 6 6 6 6 6 6 6 6 6 1 1 1 1 1 1 1 1
symmnumber: 1
zpe: 476103.8 jmol-1
zpe.correction: 0.181338 hartree
zpe.thermalcorrener: 0.196157 hartree
zpe.thermalcorrenthalpy: 0.197101 hartree
zpe.thermalcorrgfe: 0.139135 hartree
zpe.sumelectzpe: -1603.851819 hartree
zpe.sumelectthermal: -1603.837000 hartree
zpe.sumelectthermalent: -1603.836056 hartree
zpe.sumelectthermalfe: -1603.894022 hartree
dipole: 4.4661 -4.7872 0.0175
dipole: 6.5470
quadrupole: -124.0169 -106.8210 -122.2395
quadrupole: 2.3709 0.0525 -0.0245
quadrupole: -6.3245 10.8715 -4.5470 2.3709 0.0525 -0.0245
hfenergy: -1604.0331576 hartree
pointgroup: C01 [X(C13H8Cl2N2O1)]
dipole: -1.8356099 -1.806987 -0.0068712 debye
dipolederiv: -0.983483 0.0973533 0.0001637 0.1510883 -0.1476155 -0.0001843 0.0000063 -0.0001784 -0.0581974 -1.0498636 0.1488206 -0.0001163 0.1242558 -0.1290841 0.0000301 -0.0003736 -0.0000088 -0.063125 -0.8856162 -0.3902549 0.0010478 -0.6050105 -1.2046442 0.0012073 -0.0037328 -0.0035503 -0.3690644 -0.9989111 -0.6079946 -0.0009522 0.0692291 -0.4419808 -0.000208 0.0006798 0.0004193 -0.2883244 -0.9210607 -0.6715774 0.0021324 -1.0214743 -0.9348552 0.0013262 0.0064622 0.0047472 -0.7092225 -0.0547952 0.1427313 0.0002633 -0.0905514 0.1197427 0.0000251 0.0000048 -0.0004534 0.0330486 0.4957506 -0.0624897 -0.0003357 -0.1723079 0.0227018 -0.0001423 -0.0008337 0.0005004 0.013192 0.0626948 0.4757738 0.0006344 0.2844565 0.3513202 -0.0000925 0.0003655 -0.0005407 0.0411363 0.066138 0.1425334 0.0000926 -0.0987612 -0.3931816 -0.0000973 -0.0007534 0.0002142 0.0086844 -0.1477312 -0.4477336 -0.0000769 0.2044972 -0.0507409 0.0005381 -0.0003465 0.0000798 -0.216107 1.3866409 0.5479214 -0.0007509 0.3439184 1.3444429 -0.0004822 0.0040215 0.002821 0.1805461 0.008645 -0.2108205 -0.0005456 0.1828468 -0.0270633 -0.0002745 -0.0005672 0.0007299 -0.1045981 -0.1906476 0.0761499 -0.0000693 0.1566171 0.0384262 -0.0002607 -0.000081 -0.0002315 -0.1378606 0.3445964 0.9003046 -0.0015834 1.3251811 0.8124446 -0.0016978 -0.0024299 -0.0014928 0.1508843 -0.4246912 -0.0193668 -0.0000311 0.3127123 -0.0258637 -0.0001789 -0.0003461 0.0001438 -0.0612721 1.1824997 -0.0680932 -0.0000776 -0.9515572 -0.0044107 0.0007117 0.0008771 0.0003083 -0.1210959 -0.2235461 0.0199587 0.000023 0.0039742 0.0846266 -0.0001167 -0.0000175 -0.0001467 -0.0927422 1.4647784 -0.1903802 0.0003079 -0.3263375 0.0312842 -0.0000173 0.000776 -0.0000018 -0.0808026 0.0666232 0.0605189 0.0002301 0.0280351 -0.0826743 -0.0003673 0.0003924 -0.000139 0.1560256 0.116577 0.004668 0.0003232 -0.0211747 0.1879911 -0.0000726 0.0001494 -0.000284 0.3165424 0.0880538 0.0159749 0.000012 0.0470921 -0.0330455 -0.0000742 -0.0001468 -0.0000138 0.1722007 0.0221292 -0.1107976 0.0000596 -0.0733687 -0.021431 0.0001208 0.0003286 0.000126 0.1435926 0.1123735 -0.0105348 0.000033 -0.0843363 0.0938257 0.0000757 -0.0000739 0.0000395 0.161834 0.0629896 0.0589761 -0.0000358 0.0662074 -0.0155133 0.0001067 -0.000146 0.0001659 0.1611993 0.1362423 0.0504583 -0.0000339 0.104133 0.2151787 -0.0003472 -0.0009824 -0.00184 0.3841187 0.2636132 0.0479004 -0.0007141 0.0406353 0.2101194 0.0004722 -0.0032329 -0.0014142 0.3794073 unknown
polarizability: 341.2312095|3.4658621|190.7079371|-0.047885|0.01016|65.4066095 unknown
InChI: InChI=1S/C13H8Cl2N2O/c14-6-1-2-7-8-4-11(16)10(15)5-12(8)17-13(18)9(7)3-6/h1-5,17H,16H2
charge 0 multiplicity 1
26 atoms
Cl -5.236173 0.471407 0.001763
Cl 5.443134 -0.986304 0.000384
O  1.840004 3.069896 0.002164
N  -0.271375 2.101127 0.000031
N  -3.881292 -2.258947 0.00238
C  -0.653102 -0.324921 -0.000978
C  0.807934 -0.513617 -0.001164
C  -1.161552 1.011675 0.000183
C  1.666445 0.633024 -0.00144
C  -1.579626 -1.398442 -0.00129
C  1.125824 2.019221 -0.002927
C  -2.559411 1.243362 0.001235
C  1.423978 -1.799392 -0.000288
C  -2.983617 -1.198556 0.000465
C  3.07775 0.495056 -0.000799
C  -3.435103 0.155839 0.001551
C  2.820587 -1.944745 0.00017
C  3.633545 -0.786849 -0.000136
H  -1.215785 -2.430829 -0.002839
H  -0.648598 3.053493 0.001705
H  -2.955784 2.263644 0.00165
H  0.811955 -2.705909 0.000425
H  3.687421 1.403359 -0.001144
H  3.278229 -2.938209 0.000909
H  -3.552205 -3.219043 0.000252
H  -4.882182 -2.079742 -0.002763
