program: Gaussian 09
title: 000278040
version: EM64L-G09RevD.01
frameworkgroup: C1[X(C13H9ClN2O)]
method: RPBEPBE
basis: SDD
operation: Freq
keyword: #p
keyword: freq=noraman
keyword: PBEPBE/SDD
title: #p freq=noraman PBEPBE/SDD
converged: NO YES NO NO
title: Mulliken charges:
elementType: Cl O N N C C C C C C C C C C C C C H H H H H H H H H
charge: -0.059937 -0.263933 -0.449598 -0.699024 0.236531 0.356429 0.341210 0.109179 -0.025499 -0.347441 -0.626194 -0.326641 -0.345111 0.576593 -0.499078 -0.122390 -0.262934 0.328230 0.219461 0.222857 0.247119 0.280502 0.223043 0.260401 0.311586 0.314641
chargesum: 0.00000
title: Mulliken charges with hydrogens summed into heavy atoms:
elementType: Cl O N N C C C C C C C C C C C C C
charge: -0.059937 -0.263933 -0.121369 -0.072797 0.236531 0.356429 0.341210 0.109179 -0.025499 -0.127980 -0.403337 -0.079522 -0.064609 0.576593 -0.276035 -0.122390 -0.002533
polarizability: 2.98437024e+02 -1.79271886e+01 1.99624552e+02 1.56203327e-03 2.02936507e-02 6.34974642e+01
1716.lowfreq: -0.0026 -0.0018 -0.0014 4.7467 6.9744 12.8699 64.1501 82.7719 107.1056
frequency: 64.1186 82.7694 107.1048 129.8677 165.8436 251.1904 251.6817 266.3195 285.1777 326.5757 334.2312 387.7242 393.3343 407.6490 408.0309 441.6850 451.0242 457.3137 560.6751 564.9386 571.9022 627.5160 628.4866 644.0754 672.4458 702.1157 717.3113 748.1090 776.3697 796.0500 811.7374 813.2715 841.8512 854.9260 876.0305 945.0507 958.1707 987.0667 1006.2141 1043.7890 1074.4892 1093.5792 1137.1447 1155.7253 1217.5922 1244.9776 1269.1101 1291.1272 1313.3833 1339.4610 1374.9256 1388.8876 1406.5789 1433.0201 1451.8667 1488.1249 1536.9485 1547.2039 1587.4152 1603.3030 1627.6436 1643.4476 1651.5068 3115.9799 3130.5298 3155.2344 3158.3300 3171.8954 3178.0562 3514.4355 3563.4204 3703.1223
redmass: 5.2293 4.9381 8.2973 9.3697 4.6566 5.5674 5.5946 5.1177 14.6234 6.0798 4.2400 6.2987 1.0333 1.2609 4.8768 3.2165 2.7551 5.7540 6.7183 7.9436 5.1351 6.1257 2.3850 2.8767 6.0791 6.3805 2.0021 2.1491 2.3833 6.7896 5.9073 1.6695 1.6307 1.9820 1.6951 1.3779 2.8587 1.3449 4.9061 1.5562 3.2957 2.1285 1.7862 1.3400 1.4617 1.7627 1.4664 4.4443 2.1375 2.7752 2.4901 7.6351 3.1578 6.7211 2.7955 4.0771 3.9242 7.2338 7.0982 6.6545 4.7826 1.6618 2.6108 1.0913 1.0879 1.0889 1.0957 1.0911 1.0972 1.0763 1.0451 1.1041
irintensity: 1.1550 1.7193 1.5833 1.1152 0.0088 1.5115 5.1636 1.9416 0.3805 0.7922 2.2618 22.5949 0.7590 312.3722 0.8762 4.9276 0.6752 11.7783 0.1305 15.5031 9.7460 0.3195 0.1350 3.7447 2.8944 2.0741 20.3098 49.4884 37.9593 25.7869 35.9079 14.7774 46.6916 65.7361 28.9541 0.0450 0.6812 1.3786 40.6149 0.0390 15.4718 10.7402 35.5775 13.7055 42.8101 1.2143 0.1833 28.5656 90.9718 81.6424 1.2847 32.6293 16.3831 23.0157 125.9935 20.9089 43.1139 3.4184 23.7399 284.3134 523.3736 44.2983 547.3077 18.5547 14.4598 1.1417 10.7112 5.2010 1.9659 30.3108 135.5047 23.8931
temp: 298.150 k
press: 1.00000 atm
elementType: 17 8 7 7 6 6 6 6 6 6 6 6 6 6 6 6 6 1 1 1 1 1 1 1 1 1
symmnumber: 1
zpe: 502002.2 jmol-1
zpe.correction: 0.191203 hartree
zpe.thermalcorrener: 0.204633 hartree
zpe.thermalcorrenthalpy: 0.205577 hartree
zpe.thermalcorrgfe: 0.151227 hartree
zpe.sumelectzpe: -1144.466472 hartree
zpe.sumelectthermal: -1144.453042 hartree
zpe.sumelectthermalent: -1144.452097 hartree
zpe.sumelectthermalfe: -1144.506447 hartree
dipole: 6.2786 -3.1951 0.0005
dipole: 7.0448
quadrupole: -73.3232 -110.4004 -110.8356
quadrupole: -6.7317 0.0020 0.0005
quadrupole: 24.8632 -12.2140 -12.6492 -6.7317 0.0020 0.0005
hfenergy: -1144.6576743 hartree
pointgroup: C01 [X(C13H9Cl1N2O1)]
dipole: -2.6333059 -0.8646592 -0.0001791 debye
dipolederiv: -0.5198556 0.3383739 -0.0000685 0.5211012 -0.5883219 0.0000988 -0.0001133 0.0000997 -0.073024 -0.6360088 -0.2185106 0.0000883 -0.3871197 -1.4040121 0.0002642 -0.0001257 -0.0001718 -0.3728883 -0.9658622 -0.5974937 0.0000178 -0.2402008 -0.6127678 0.0000299 0.0000651 0.0000865 -0.3000308 -2.0070362 -0.2114824 0.0001638 -0.0792389 -0.1109802 -0.0000721 0.0004581 -0.0000331 -0.7317289 -0.792869 -0.0626511 0.0000357 -0.1705019 -0.3911955 0.0000605 0.0000534 0.0000201 -0.0614609 1.1354716 0.1442292 -0.0000544 -0.1016541 0.1583414 -0.0000424 -0.0000784 0.0000214 0.0457714 0.7644637 0.2271718 -0.0000526 0.1694885 0.7035315 -0.000101 -0.0000319 -0.0001107 0.132804 -0.3698427 0.3088961 -0.0000383 -0.1597803 -0.5302032 0.0000742 -0.0000142 0.0001091 -0.0137253 1.2672171 0.3180368 -0.0000665 0.2489314 1.6227102 -0.0002689 0.0001806 0.0000278 0.1872633 0.5656451 0.2166858 -0.0000559 0.3428148 0.2536453 -0.0000623 -0.0000768 -0.0000796 -0.0881505 -0.651048 -0.1916306 0.0000387 -0.56294 -0.1281761 0.0000016 0.0000774 0.0000231 -0.2954074 -0.7437189 0.1212637 -0.0000212 0.4210086 -0.1275958 0.0000073 -0.0000755 0.0000183 -0.1264958 0.2072403 -0.2510243 0.0000535 0.1184908 0.1241477 -0.0000461 -0.0000155 -0.0000404 -0.0936937 2.0814557 0.248656 -0.0001616 -0.039516 0.1484181 -0.0000033 -0.0001537 -0.0000096 0.1761723 -0.8226826 -0.1599037 0.000029 0.5018345 0.0275543 -0.0000656 -0.0000778 -0.0000471 -0.2560086 0.9618085 -0.4223622 0.0001002 -0.6525661 0.9726391 -0.0001847 0.0001594 -0.0001837 -0.0457994 -0.2532132 0.1730117 -0.0000142 0.1002471 -0.464989 0.0000651 -0.0000223 0.0000716 -0.1407153 0.1148131 -0.0016767 0.0000237 -0.0160116 0.1726099 0.0000213 0.0000193 -0.0000027 0.3118423 0.0608715 0.1127615 -0.0000139 0.0757776 -0.0317584 0.0000247 -0.0000101 0.0000292 0.1350687 -0.014378 0.0644113 -0.0000003 0.1061326 -0.0700052 0.0000337 -0.0000021 0.0000332 0.1844436 0.0900031 -0.0745775 0.000007 -0.0416841 -0.0190481 0.0000247 0.0000306 0.0000259 0.1541329 0.0978568 -0.0004538 0. -0.0764123 0.0200025 0.0000254 0.0000043 0.0000278 0.1535632 -0.021862 -0.0998969 0.0000241 -0.0976902 -0.0635376 0.0000394 0.000025 0.0000475 0.1749456 -0.046215 -0.0101064 -0.0000097 0.0005817 0.0981802 0.0000093 -0.0000127 -0.0000003 0.1707212 0.2490605 -0.0016749 -0.0000118 -0.0667396 0.1058411 0.0000585 -0.0001244 0.0000662 0.3859225 0.2486855 0.0299469 -0.0000127 0.0856468 0.1349695 0.000008 -0.0001388 -0.0000283 0.3864783 unknown
polarizability: 301.5444565|2.1621387|196.5171191|-0.0015585|-0.0202939|63.4974642 unknown
InChI: InChI=1S/C13H9ClN2O/c14-7-1-3-10-11(5-7)9-4-2-8(15)6-12(9)16-13(10)17/h1-6,16H,15H2
charge 0 multiplicity 1
26 atoms
Cl 4.114156 -2.720501 0.000485
O  0.962271 3.389659 -0.000365
N  -0.872634 1.968807 -0.000399
N  -4.964761 -0.685335 0.000265
C  -0.698889 -0.468583 -0.000038
C  0.760543 -0.330639 -0.000072
C  -1.50481 0.716217 -0.000161
C  1.349951 0.977335 -0.000273
C  0.512694 2.200303 -0.000625
C  -1.387541 -1.714155 0.000199
C  -2.917343 0.651283 -0.000065
C  1.637737 -1.455955 0.00014
C  2.758931 1.139578 -0.000202
C  -3.575984 -0.603036 0.000144
C  -2.783251 -1.795813 0.000279
C  3.022496 -1.258512 0.000185
C  3.614577 0.027526 0.000024
H  -1.446452 2.817723 -0.000417
H  -0.816911 -2.648048 0.000339
H  -3.503094 1.579505 -0.000155
H  1.24528 -2.475659 0.000279
H  3.155022 2.160139 -0.00037
H  -3.277703 -2.774016 0.00047
H  4.701847 0.141074 0.000067
H  -5.540815 0.151523 0.000024
H  -5.430016 -1.588419 0.000241
