program: Gaussian 09
title: 000278077
version: EM64L-G09RevD.01
frameworkgroup: C1[X(C17H14N4O)]
method: RPBEPBE
basis: SDD
operation: Freq
keyword: #p
keyword: freq=noraman
keyword: PBEPBE/SDD
title: #p freq=noraman PBEPBE/SDD
converged: YES YES NO NO
title: Mulliken charges:
elementType: O N N N N C C C C C C C C C C C C C C C C C H H H H H H H H H H H H H H
charge: -0.211267 -0.179900 -0.385565 -0.038883 -0.038882 -0.090119 0.312232 0.103979 0.259727 0.225070 0.225057 0.139906 0.139906 -0.394024 -0.339408 -0.648053 -0.242858 -0.786708 -0.786709 -0.214341 -0.300919 -0.300921 0.242476 0.318842 0.243911 0.239217 0.239218 0.270342 0.227607 0.249728 0.285416 0.237043 0.285416 0.249724 0.237047 0.226692
chargesum: 0.00000
title: Mulliken charges with hydrogens summed into heavy atoms:
elementType: O N N N N C C C C C C C C C C C C C C C C C
charge: -0.211267 -0.179900 -0.066723 -0.038883 -0.038882 -0.090119 0.312232 0.103979 0.259727 0.225070 0.225057 0.139906 0.139906 -0.151548 -0.095498 0.100724 -0.015251 -0.014520 -0.014522 0.012352 -0.300919 -0.300921
polarizability: 2.62535014e+02 -1.50055554e-04 1.94384918e+02 7.78048435e+00 -1.50772512e-03 1.73171812e+02
1716.lowfreq: -8.6643 -6.8479 -0.0009 -0.0008 -0.0006 8.1996 23.2086 40.6081 58.6580
frequency: 23.1927 40.5997 58.6577 75.9075 80.9859 96.0629 100.4322 109.9529 113.9847 136.3483 155.4960 161.8511 192.8237 201.8599 252.5997 265.3613 279.1782 283.0343 297.7883 332.6346 340.9768 377.3043 418.8241 430.0104 460.8016 475.1439 475.3217 511.6842 522.4831 530.0317 538.4929 545.6948 598.8442 606.5138 629.5164 661.6313 670.6507 687.4010 689.2177 749.3256 759.8508 790.1820 856.4623 879.3463 881.6958 921.2395 941.4778 962.4500 980.5485 1020.0561 1032.0348 1033.1919 1044.8635 1046.4695 1051.1920 1068.6107 1121.5972 1124.9028 1131.3372 1172.8549 1201.3991 1223.1797 1227.5387 1256.4396 1301.7879 1307.7132 1323.4419 1339.6328 1403.4245 1406.1062 1406.5811 1428.9045 1450.5013 1454.8084 1461.6242 1471.4097 1471.5191 1478.1183 1478.6693 1486.9725 1496.3474 1607.8787 1622.3561 1637.9601 1657.0233 1663.4568 2155.5443 2157.4650 2979.8810 2980.3211 2983.2842 3054.6251 3054.8883 3067.4128 3110.8953 3121.2423 3121.3676 3130.9030 3139.6327 3156.1922 3169.7889 3565.5155
redmass: 6.7221 4.8684 4.9537 1.5257 1.4704 1.9522 2.1938 5.3446 12.0199 2.8614 1.1997 4.9065 3.6083 4.8991 4.5410 3.1162 3.1468 6.2539 7.8228 4.5010 7.1794 4.7495 4.8797 6.7397 3.6868 8.4059 5.2491 5.8197 2.2328 2.5756 3.3818 4.1689 4.7825 7.5091 4.4440 6.4291 6.9185 6.5214 6.3121 2.2089 1.8348 5.7981 1.7773 3.3861 4.5268 5.7684 1.4346 1.8124 1.3212 2.2072 4.4960 2.0867 1.5808 1.5407 2.6177 3.2228 2.5567 1.3196 1.6685 1.1057 6.7172 10.9800 3.2205 2.4351 1.9832 2.0066 5.2550 4.9153 1.2329 1.3760 4.1031 1.2447 1.3095 2.2941 1.0740 1.0442 1.0455 1.0431 1.7249 1.6451 1.8277 7.4770 7.7515 4.3214 10.4807 8.2271 12.6268 12.6182 1.0395 1.0395 1.0342 1.0979 1.0979 1.1023 1.0993 1.0965 1.0965 1.0863 1.0900 1.0941 1.1001 1.0778
irintensity: 10.6929 5.4072 0.8355 0.0741 0.1830 0.0028 0.1810 0.0701 4.4726 2.4971 0.4043 0.2136 2.6185 1.7418 1.1061 5.9553 0.0478 0.5555 1.6104 0.0363 4.8152 0.1057 0.8215 1.4790 4.7923 4.4492 0.0453 7.3089 45.4650 8.0896 33.1818 1.2513 1.0012 0.9525 0.9324 4.4440 5.9421 5.5605 2.1937 21.6640 60.4516 2.5095 1.9734 0.0786 15.0214 0.1246 1.4009 7.9873 0.0447 7.4652 19.5116 9.2633 0.0047 4.1207 0.0001 35.0742 17.4056 0.0293 24.4381 1.4850 3.5933 9.1405 2.6547 25.7447 23.3606 45.5063 21.4262 33.2687 46.0706 14.9026 1.0279 10.3908 234.4025 17.3474 13.7806 0.2958 26.3859 14.3122 139.5423 10.6619 226.3360 48.8170 130.3987 32.4567 146.3787 156.2091 84.9330 24.9422 1.8304 47.5378 43.1176 0.0025 22.2210 19.3752 1.3530 4.3024 2.6767 0.8128 8.8077 21.4076 21.4520 70.6786
temp: 298.150 k
press: 1.00000 atm
elementType: 8 7 7 7 7 6 6 6 6 6 6 6 6 6 6 6 6 6 6 6 6 6 1 1 1 1 1 1 1 1 1 1 1 1 1 1
symmnumber: 1
zpe: 713050.5 jmol-1
zpe.correction: 0.271587 hartree
zpe.thermalcorrener: 0.292239 hartree
zpe.thermalcorrenthalpy: 0.293183 hartree
zpe.thermalcorrgfe: 0.221859 hartree
zpe.sumelectzpe: -948.905028 hartree
zpe.sumelectthermal: -948.884375 hartree
zpe.sumelectthermalent: -948.883431 hartree
zpe.sumelectthermalfe: -948.954755 hartree
dipole: 4.3873 0.0002 -1.8710
dipole: 4.7696
quadrupole: -84.5398 -155.5468 -125.8762
quadrupole: 0.0011 -10.6755 0.0015
quadrupole: 37.4478 -33.5592 -3.8886 0.0011 -10.6755 0.0015
hfenergy: -949.1766145 hartree
pointgroup: C01 [X(C17H14N4O1)]
dipole: -1.7147053 0.0003733 -0.7622537 debye
polarizability: 262.7507493|-0.0108173|194.3849187|-6.4195332|0.0069534|172.9560763 unknown
InChI: InChI=1S/C17H14N4O/c1-10-13(8-18)17(14(9-19)11(2)20-10)12-6-4-5-7-15(12)21(3)16(17)22/h4-7,20H,1-3H3
charge 0 multiplicity 1
36 atoms
O  -0.513209 -0.000453 2.577438
N  1.619971 -0.000572 1.545071
N  -3.155028 0.000573 -0.343469
N  0.164284 -3.556669 -0.214075
N  0.165357 3.556772 -0.212383
C  -0.269672 0.000072 0.05199
C  1.056804 0.000012 -0.711133
C  0.221383 -0.000273 1.55762
C  2.129044 -0.000371 0.217287
C  -1.115819 -1.261464 -0.201363
C  -1.115445 1.261953 -0.200897
C  -2.490386 -1.228546 -0.327338
C  -2.490023 1.229489 -0.326873
C  1.313776 0.000254 -2.087708
C  3.471156 -0.000525 -0.199621
C  2.4381 -0.001021 2.757339
C  2.66197 0.000112 -2.531365
C  -3.369197 -2.447363 -0.469748
C  -3.368474 2.448619 -0.46882
C  3.722162 -0.000272 -1.594997
C  -0.429951 -2.515344 -0.213397
C  -0.429204 2.515634 -0.212473
H  0.488242 0.000548 -2.808264
H  -4.172805 0.000736 -0.409134
H  4.297798 -0.000824 0.517513
H  3.077295 0.8996 2.799957
H  3.076963 -0.901899 2.799513
H  1.755245 -0.001107 3.621973
H  2.884386 0.000299 -3.60338
H  -4.065656 -2.526852 0.386987
H  -2.765821 -3.366271 -0.498364
H  -3.973125 -2.401263 -1.395922
H  -2.764829 3.367363 -0.497009
H  -4.064961 2.527945 0.387907
H  -3.97236 2.403088 -1.395049
H  4.758033 -0.000381 -1.951911
