program: Gaussian 09
title: 000278047
version: EM64L-G09RevD.01
frameworkgroup: C1[X(C15H10Cl2N2O2)]
method: RPBEPBE
basis: SDD
operation: Freq
keyword: #p
keyword: freq=noraman
keyword: PBEPBE/SDD
title: #p freq=noraman PBEPBE/SDD
converged: YES YES NO YES
title: Mulliken charges:
elementType: Cl Cl O O N N C C C C C C C C C C C C C C C H H H H H H H H H H
charge: -0.043708 -0.040278 -0.253325 -0.263082 -0.440427 -0.445898 0.340352 0.314791 0.309209 0.117501 -0.527667 -0.015535 0.697019 -0.458846 -0.361604 -0.472930 -0.318826 -0.225023 -0.125722 0.218197 -0.795238 0.307727 0.336599 0.260070 0.250614 0.301113 0.261160 0.320246 0.241700 0.270058 0.241748
chargesum: 0.00000
title: Mulliken charges with hydrogens summed into heavy atoms:
elementType: Cl Cl O O N N C C C C C C C C C C C C C C C
charge: -0.043708 -0.040278 -0.253325 -0.263082 -0.103827 -0.125651 0.340352 0.314791 0.309209 0.117501 -0.219940 -0.015535 0.697019 -0.198775 -0.110989 -0.472930 -0.017712 0.036138 -0.125722 0.218197 -0.041731
polarizability: 3.70105547e+02 3.19952996e+00 2.37210899e+02 1.60612716e-03 -6.55176555e-04 7.93560361e+01
1716.lowfreq: -71.4080 -2.8301 0.0017 0.0020 0.0023 1.6811 5.7437 35.6005 46.6317
frequency: -71.3976 35.5747 46.6250 70.6454 81.9967 99.1041 108.6857 146.6084 155.1554 197.6669 207.9259 225.2893 232.3426 269.0330 283.9391 323.3998 339.8949 378.9097 404.8817 429.3774 430.5068 457.6802 480.0188 496.4739 525.6536 527.0164 578.7056 579.7496 632.9158 648.9683 651.1007 665.9288 689.8062 691.6320 721.0860 728.1804 744.5145 785.9139 805.6190 838.0682 855.9916 874.8998 918.8498 934.5233 940.2320 943.5592 971.6221 988.2001 1032.9674 1040.7110 1074.1876 1098.4846 1151.2452 1205.1173 1225.2495 1237.6035 1253.1161 1280.8304 1289.1472 1294.1799 1373.5527 1377.6775 1384.9044 1397.7482 1414.4055 1430.5619 1447.9164 1466.5084 1476.7050 1485.3526 1523.2478 1557.4619 1585.6455 1604.7805 1624.0479 1630.4268 1633.3851 2990.7779 3076.0211 3138.8809 3154.7628 3158.3330 3171.2419 3176.2004 3190.8651 3491.0578 3516.4089
redmass: 1.0311 12.7498 6.0628 6.0362 7.0258 5.8666 6.4331 9.6773 5.6366 13.7783 5.5613 12.6872 6.4323 12.2715 4.7778 5.0366 7.1429 13.7249 4.7998 5.8082 3.5147 4.3806 6.7497 6.6793 6.1463 3.3227 3.1992 6.5838 5.0351 2.7784 7.1596 2.5348 7.2819 1.4360 2.1963 6.8969 2.3684 3.5073 6.9162 1.5940 1.6318 4.3161 6.0040 1.4641 1.4738 5.8813 1.3496 1.8783 1.6631 2.7668 1.8270 6.5093 1.6267 1.9802 2.2285 1.8476 1.9350 2.7167 2.8124 1.7187 4.2193 1.2411 6.5793 3.2527 5.5609 3.0656 1.2926 1.0464 2.2281 3.6244 2.8246 6.4519 6.1626 6.4307 5.9611 5.7953 5.4676 1.0383 1.0983 1.0982 1.0887 1.0926 1.0928 1.0971 1.0911 1.0765 1.0766
irintensity: 0.1388 1.3974 0.0388 10.7296 1.1663 0.0642 2.9852 4.4387 0.0027 0.7737 2.1694 0.9692 1.0659 2.5999 1.9888 0.1151 3.2796 21.3659 0.1839 15.0919 12.3934 6.9714 13.2189 8.9137 14.8094 1.0220 2.1770 5.3601 10.0175 34.8517 4.7308 0.0027 31.8823 67.7081 4.9153 10.5024 64.7335 6.0879 20.6332 29.7465 47.4021 34.4274 4.7319 29.1356 13.4876 19.1301 3.6309 37.4856 8.6082 24.6490 12.6716 5.2261 8.8120 3.1203 20.4279 51.7481 150.7455 98.3622 16.1631 51.9867 67.3140 71.3552 73.0386 50.1332 89.3607 92.4292 26.4748 20.3349 73.6538 93.1268 435.3190 17.7137 65.0416 137.2937 245.4314 43.1759 170.9515 6.5835 12.5286 5.7708 3.1384 1.1253 2.9408 6.7475 9.0643 44.1672 42.6603
temp: 298.150 k
press: 1.00000 atm
elementType: 17 17 8 8 7 7 6 6 6 6 6 6 6 6 6 6 6 6 6 6 6 1 1 1 1 1 1 1 1 1 1
symmnumber: 1
zpe: 573048.3 jmol-1
zpe.correction: 0.218263 hartree
zpe.thermalcorrener: 0.235607 hartree
zpe.thermalcorrenthalpy: 0.236551 hartree
zpe.thermalcorrgfe: 0.171973 hartree
zpe.sumelectzpe: -1756.285089 hartree
zpe.sumelectthermal: -1756.267745 hartree
zpe.sumelectthermalent: -1756.266800 hartree
zpe.sumelectthermalfe: -1756.331378 hartree
dipole: 6.4348 -0.3649 0.0002
dipole: 6.4451
quadrupole: -131.3358 -137.0133 -137.7173
quadrupole: 5.6997 0.0004 -0.0004
quadrupole: 4.0196 -1.6578 -2.3618 5.6997 0.0004 -0.0004
hfenergy: -1756.5033515 hartree
pointgroup: C01 [X(C15H10Cl2N2O2)]
dipole: -2.5293932 0.1787175 0.0002845 debye
polarizability: 367.1622181|-19.8172967|240.1541442|-0.0388441|0.1145519|79.3561198 unknown
InChI: InChI=1S/C15H10Cl2N2O2/c1-7(20)18-14-5-10-9-3-2-8(16)4-11(9)15(21)19-13(10)6-12(14)17/h2-6,18-19H,1H3
charge 0 multiplicity 1
31 atoms
Cl -4.119091 2.483292 0.002007
Cl 5.547475 -2.269938 -0.002189
O  3.40522 2.724319 0.001545
O  -2.979675 -2.751289 -0.001668
N  1.098131 2.46736 0.001561
N  -3.7220 -0.522685 -0.000049
C  -0.020255 0.286768 0.000143
C  1.305042 -0.353995 -0.000432
C  -0.085447 1.714862 0.00114
C  2.481443 0.462277 0.000037
C  -1.22992 -0.451326 -0.000249
C  2.402465 1.946916 0.001093
C  -2.493722 0.182843 0.000301
C  -1.341397 2.37247 0.001699
C  1.477078 -1.768754 -0.001459
C  -2.509727 1.608396 0.001273
C  3.776341 -0.115438 -0.000493
C  2.756306 -2.347902 -0.001991
C  3.895298 -1.507991 -0.001498
C  -3.924012 -1.907643 -0.001036
C  -5.396255 -2.311845 -0.001198
H  -1.230881 -1.541829 -0.001002
H  1.043299 3.490526 0.002267
H  -1.400488 3.465114 0.002447
H  0.607619 -2.432036 -0.001855
H  4.644086 0.550536 -0.0001
H  2.873983 -3.435286 -0.002777
H  -4.559594 0.068138 0.000472
H  -5.918494 -1.925561 0.893516
H  -5.45837 -3.40916 -0.001303
H  -5.918253 -1.925438 -0.896003
