program: Gaussian 09
title: 000278041
version: EM64L-G09RevD.01
frameworkgroup: C1[X(C13H9ClN2O)]
method: RPBEPBE
basis: SDD
operation: Freq
keyword: #p
keyword: freq=noraman
keyword: PBEPBE/SDD
title: #p freq=noraman PBEPBE/SDD
converged: YES YES NO NO
title: Mulliken charges:
elementType: Cl O N N C C C C C C C C C C C C C H H H H H H H H H
charge: -0.079847 -0.268278 -0.445250 -0.696526 0.256506 0.479212 0.336440 0.082707 -0.021779 -0.328400 -0.640681 -0.327463 -0.348821 0.570670 -0.512494 -0.233834 -0.247951 0.329478 0.245447 0.221270 0.283927 0.221586 0.257879 0.241205 0.310449 0.314546
chargesum: 0.00000
title: Mulliken charges with hydrogens summed into heavy atoms:
elementType: Cl O N N C C C C C C C C C C C C C
charge: -0.079847 -0.268278 -0.115772 -0.071531 0.256506 0.479212 0.336440 0.082707 -0.021779 -0.082952 -0.419411 -0.327463 -0.064894 0.570670 -0.290908 0.024045 -0.006746
polarizability: 2.90318946e+02 1.63463375e+01 1.99199855e+02 8.93365839e-03 6.43924394e-03 6.37900767e+01
1716.lowfreq: -7.6480 -5.4660 0.0015 0.0025 0.0026 3.4781 25.6701 62.1830 105.5083
frequency: 25.6082 62.1692 105.5082 182.3919 184.9941 219.2337 237.3092 251.0237 295.9795 341.1680 346.1094 382.0607 388.5339 401.7304 420.3199 442.4230 449.8250 476.5920 498.5838 545.0051 570.3012 627.0819 630.6488 663.8113 679.6696 713.8676 734.1188 752.4125 767.7738 775.4049 806.6985 820.7871 821.4645 852.3842 935.4116 948.7232 966.5504 984.8920 997.9607 1042.1685 1083.5954 1091.6717 1149.1503 1160.2737 1194.6983 1230.2193 1267.1217 1290.8594 1323.3164 1338.4442 1359.6921 1385.0392 1407.6433 1423.0047 1437.3798 1488.1875 1529.6466 1543.9409 1576.3556 1600.8081 1626.0914 1642.2052 1652.4122 3115.5566 3134.1616 3149.7411 3164.5691 3178.6230 3228.3622 3518.1368 3564.0430 3703.5394
redmass: 6.0908 4.6881 7.7867 7.2930 4.5788 5.1868 8.6004 4.6251 8.3516 6.6930 4.1760 5.4565 1.0367 1.3033 6.0999 2.7709 6.0014 4.4431 7.8272 3.7476 6.8159 2.8669 6.1855 2.5819 6.2848 2.2134 6.1784 2.2276 1.7625 7.1340 1.5279 2.4882 6.2801 2.1269 1.3713 1.3892 3.0090 5.9361 1.3438 1.5686 5.3001 1.7910 2.0561 1.3263 1.3720 1.4787 2.2059 2.4379 2.8961 2.8665 7.3846 2.1041 3.3235 3.2674 3.4570 4.0914 3.9840 5.7595 7.3955 6.2624 4.7227 1.4994 3.0578 1.0913 1.0914 1.0868 1.0924 1.1001 1.0908 1.0763 1.0451 1.1040
irintensity: 0.3898 4.9831 0.0633 2.5821 0.0000 0.0025 1.4870 9.3109 0.7507 8.9292 13.1423 1.2681 1.8365 298.9653 4.7539 0.0009 9.7401 0.3442 0.7636 0.2522 4.5822 0.7138 19.5422 25.5979 0.7288 0.1876 18.3804 53.3889 75.0736 3.9691 1.0488 34.4642 18.6685 91.9510 0.3101 0.0348 1.8490 0.8942 2.0369 3.3124 37.6583 28.0277 14.8936 2.5478 26.6057 17.1995 4.4119 6.6540 91.4410 74.0488 25.1682 3.2265 24.6867 101.0977 73.1132 0.0699 37.7566 46.5358 23.8760 102.4865 467.1036 16.6296 573.6240 18.6786 18.9052 2.5093 0.3650 14.0429 9.3336 27.8589 131.9990 23.5335
temp: 298.150 k
press: 1.00000 atm
elementType: 17 8 7 7 6 6 6 6 6 6 6 6 6 6 6 6 6 1 1 1 1 1 1 1 1 1
symmnumber: 1
zpe: 501876.4 jmol-1
zpe.correction: 0.191155 hartree
zpe.thermalcorrener: 0.204656 hartree
zpe.thermalcorrenthalpy: 0.205600 hartree
zpe.thermalcorrgfe: 0.150484 hartree
zpe.sumelectzpe: -1144.457103 hartree
zpe.sumelectthermal: -1144.443602 hartree
zpe.sumelectthermalent: -1144.442658 hartree
zpe.sumelectthermalfe: -1144.497774 hartree
dipole: -4.9550 -1.7356 0.0088
dipole: 5.2502
quadrupole: -66.2185 -113.4753 -110.9232
quadrupole: -6.4392 -0.0268 0.0092
quadrupole: 30.6538 -16.6030 -14.0508 -6.4392 -0.0268 0.0092
hfenergy: -1144.6482579 hartree
pointgroup: C01 [X(C13H9Cl1N2O1)]
dipole: -2.0111482 -0.4710498 0.0025841 debye
dipolederiv: -0.1689078 -0.1704866 0.0004424 -0.0410356 -0.7359209 0.0022313 -0.0000297 0.0022296 -0.076533 -0.7188265 -0.27979 0.0007501 -0.499351 -1.3046008 0.0031635 0.001628 0.0033339 -0.3728502 -1.0175353 -0.545097 0.0013815 -0.1693916 -0.4857793 0.0004922 0.0000998 0.0000276 -0.2951829 -1.9906926 0.0716542 -0.0024837 0.205538 -0.1097633 -0.0016088 -0.0053094 -0.0017279 -0.7292282 -0.7961569 -0.038061 -0.0007807 -0.0946105 -0.2778719 0.0006264 -0.0004807 0.0006535 -0.0649338 1.0378458 -0.1153581 0.001599 -0.1299211 -0.1786773 0.0006512 0.0014388 0.0006954 0.0715444 0.8216974 0.2112062 -0.0000362 0.0878072 0.6299723 -0.0016757 0.0002111 -0.0015301 0.1390083 -0.2244018 0.3491673 -0.0015492 -0.1719001 -0.4578944 0.0015797 0.0004957 0.0022741 -0.0033945 1.2870491 0.3153735 -0.0002869 0.3396988 1.4780228 -0.0048867 -0.0003781 -0.0049561 0.1822378 0.5937454 0.1707161 0.0002107 0.3206378 0.0922299 -0.0001271 -0.0003244 -0.0003737 -0.0902834 -0.7662469 -0.1051475 -0.0001972 -0.4537682 -0.0288948 -0.0013761 0.0011739 -0.0010606 -0.3011751 -0.3017923 0.3591557 -0.0014463 0.3143498 1.0135941 -0.0034604 -0.0013506 -0.0035548 -0.0851844 -0.0269479 -0.1596018 0.0007614 0.1463621 0.0704471 -0.000429 -0.0005775 -0.0008922 -0.1031005 2.0702713 -0.0380899 0.0025591 -0.30835 0.1732231 -0.0003832 0.0032566 -0.0000388 0.1784828 -0.7325683 -0.00754 -0.0004622 0.6110683 -0.0367796 0.0001273 -0.0020376 -0.0005784 -0.2539344 0.1350457 -0.0448056 0.0004901 0.012998 -0.0694706 -0.0001017 0.0003684 -0.0001007 -0.0815949 -0.0026303 0.0256117 0.0004238 -0.1069493 -0.1639848 -0.000175 0.0008979 -0.0000207 -0.1798425 0.1152196 0.0117766 -0.0002605 -0.0081078 0.1698207 0.0005241 -0.0002203 0.0007109 0.3112635 0.1705249 0.0143788 0.0000524 -0.0178403 0.0208984 0.0003275 0.0001446 0.0004161 0.1494605 0.0125765 0.0483237 -0.0003305 0.092868 -0.0989971 0.0009939 -0.0004419 0.0010195 0.1837559 0.1099515 -0.0164674 -0.0000307 -0.0925359 0.0378769 0.0002681 0.0002469 0.0004183 0.1564514 -0.0530132 -0.0976769 0.0000135 -0.1024876 -0.0376092 0.0005121 0.000027 0.0004693 0.1714467 0.0651524 0.0520698 -0.0003799 0.0850321 -0.0119087 0.0007875 -0.0005305 0.0007192 0.1575972 -0.1121989 -0.0028009 -0.0005557 -0.0021358 0.074316 0.0003375 -0.0005853 0.0003327 0.1655066 0.2320249 -0.0197178 0.000074 -0.0835605 0.117458 0.0005245 0.0013093 0.0003664 0.3851995 0.2608141 0.0112069 0.0000416 0.0655851 0.1202934 0.0010768 0.0009681 0.0011675 0.3852829 unknown
polarizability: 292.7487252|6.3145844|196.7680399|0.2820983|-0.4658792|63.7921131 unknown
InChI: InChI=1S/C13H9ClN2O/c14-10-3-1-2-9-12(10)8-5-4-7(15)6-11(8)16-13(9)17/h1-6,16H,15H2
charge 0 multiplicity 1
26 atoms
Cl 1.095879 -3.386924 0.013535
O  1.527938 3.201752 -0.010546
N  -0.462646 2.022852 -0.007629
N  -4.873782 -0.002032 -0.005544
C  -0.596656 -0.432413 0.000403
C  0.879811 -0.487677 0.002448
C  -1.238964 0.855704 -0.004458
C  1.617319 0.760262 -0.000758
C  0.930362 2.078735 -0.006636
C  -1.484823 -1.552387 0.002933
C  -2.644572 1.00357 -0.006202
C  1.721853 -1.650465 0.00813
C  3.031458 0.820541 0.00159
C  -3.489361 -0.130986 -0.003459
C  -2.876917 -1.421469 0.000984
C  3.126064 -1.596382 0.010802
C  3.796868 -0.35266 0.007541
H  -0.932225 2.933157 -0.011719
H  -1.076192 -2.560398 0.006407
H  -3.077502 2.012002 -0.009905
H  3.488349 1.814878 -0.00129
H  -3.504576 -2.320045 0.002796
H  3.691044 -2.532916 0.015505
H  4.890309 -0.319137 0.009759
H  -5.317438 0.911847 -0.007318
H  -5.469801 -0.824608 -0.002068
