program: Gaussian 09
title: 000278039
version: EM64L-G09RevD.01
frameworkgroup: C1[X(C13H9BrN2O)]
method: RPBEPBE
basis: SDD
operation: Freq
keyword: #p
keyword: freq=noraman
keyword: PBEPBE/SDD
title: #p freq=noraman PBEPBE/SDD
converged: YES YES NO NO
title: Mulliken charges:
elementType: Br O N N C C C C C C C C C C C C C H H H H H H H H H
charge: 0.014869 -0.263760 -0.433216 -0.714131 0.354829 0.292554 0.430687 0.112353 -0.638068 -0.017936 -0.418716 -0.363599 0.577670 -0.350300 -0.489080 -0.241580 -0.239209 0.215662 0.334859 0.220137 0.279819 0.245905 0.229662 0.235666 0.310976 0.313947
chargesum: 0.00000
title: Mulliken charges with hydrogens summed into heavy atoms:
elementType: Br O N N C C C C C C C C C C C C C
charge: 0.014869 -0.263760 -0.098357 -0.089207 0.354829 0.292554 0.430687 0.112353 -0.422406 -0.017936 -0.418716 -0.143462 0.577670 -0.070482 -0.243175 -0.011918 -0.003542
polarizability: 2.75015645e+02 -1.54807278e+01 2.24108947e+02 1.95993344e-02 -1.35454854e-02 6.39472462e+01
1716.lowfreq: -0.0007 -0.0001 0.0004 4.1598 9.4206 11.7047 43.6249 86.0695 127.5051
frequency: 43.6187 86.0575 127.5044 135.5258 161.4996 191.5917 207.7778 238.7831 247.0048 308.4927 330.4658 358.4543 381.8908 382.9618 392.7759 422.5357 465.9894 474.2928 495.9037 555.0430 578.6515 609.0435 631.5731 649.9540 652.6278 732.9533 734.8865 744.7628 780.2883 785.4980 792.3959 846.2538 861.7787 871.7612 891.7711 919.8330 977.0116 1007.9814 1024.5397 1042.7851 1051.7763 1085.5732 1135.4665 1173.9967 1190.4265 1252.9067 1263.7438 1277.3851 1321.9195 1328.0845 1377.5910 1392.0907 1412.6876 1440.5453 1445.8519 1488.6627 1501.9430 1555.7203 1576.2395 1610.5697 1625.9819 1640.5414 1649.7246 3131.2500 3144.8893 3149.9915 3157.9996 3160.0765 3170.9388 3489.0037 3570.9144 3710.4428
redmass: 8.1027 4.7991 13.4403 6.3138 4.3547 5.1007 4.4205 10.9543 4.2496 7.9678 1.0427 1.2269 5.9246 6.2524 6.1506 3.1999 4.0387 6.4751 5.6838 3.7722 6.5118 2.8270 7.1908 2.3534 5.8375 6.0915 2.8087 1.5378 7.6002 1.7518 2.7462 1.4986 4.8702 2.1704 1.5169 6.9266 1.3787 1.3409 2.4065 2.0396 1.7790 3.0482 2.2894 1.1939 1.4635 1.8985 1.5903 2.5627 2.8037 2.2897 4.9156 7.8287 2.9814 3.0071 2.9055 3.6706 4.2552 7.0936 6.3289 5.7842 6.5263 1.4731 2.9260 1.0858 1.0905 1.0897 1.0927 1.0933 1.1001 1.0761 1.0451 1.1041
irintensity: 0.5822 1.1129 0.1417 0.0775 0.6882 8.3844 2.5455 1.9963 0.0421 4.6277 3.2225 281.4628 3.0628 32.6500 4.7110 4.6980 0.2243 2.7242 2.9152 0.9636 13.3912 10.6155 12.4889 0.0226 3.6106 10.8134 7.9513 92.1396 33.0438 95.1338 1.0846 14.9179 27.9111 34.5189 0.0107 13.5915 2.3225 0.7321 6.2719 8.4558 17.8114 2.0004 21.3314 5.3984 18.9135 15.6383 28.1539 20.9031 7.5500 146.7807 27.9845 45.2298 20.3905 21.2343 2.2165 33.9232 82.1726 16.1348 62.6374 395.2980 270.2054 86.3864 127.5591 4.4619 4.8367 8.1019 3.0810 22.5266 29.7875 64.6139 100.6807 22.3025
temp: 298.150 k
press: 1.00000 atm
elementType: 35 8 7 7 6 6 6 6 6 6 6 6 6 6 6 6 6 1 1 1 1 1 1 1 1 1
symmnumber: 1
zpe: 500215.2 jmol-1
zpe.correction: 0.190522 hartree
zpe.thermalcorrener: 0.204321 hartree
zpe.thermalcorrenthalpy: 0.205265 hartree
zpe.thermalcorrgfe: 0.149521 hartree
zpe.sumelectzpe: -697.860413 hartree
zpe.sumelectthermal: -697.846614 hartree
zpe.sumelectthermalent: -697.845670 hartree
zpe.sumelectthermalfe: -697.901414 hartree
dipole: -0.8585 7.1702 0.0152
dipole: 7.2215
quadrupole: -91.2053 -96.3792 -113.7170
quadrupole: 1.6664 -0.0206 0.0570
quadrupole: 9.2285 4.0546 -13.2831 1.6664 -0.0206 0.0570
hfenergy: -698.0509348 hartree
pointgroup: C01 [X(C13H9Br1N2O1)]
dipole: -1.2964881 -2.5280729 -0.0059981 debye
dipolederiv: -0.2311034 0.2207165 0.0001822 0.2902669 -0.5273523 0.0000955 -0.0002956 0.000444 -0.023195 -0.8824705 -0.3487038 0.0002536 -0.624402 -1.165337 0.0002661 -0.0011733 -0.0009284 -0.3729798 -1.0826363 -0.5891897 -0.0001638 0.0569772 -0.4758158 0.0000002 0.0000933 -0.0001895 -0.2649364 -0.8383025 -0.7151642 0.0008548 -0.9823022 -1.0409061 0.0024972 0.0054743 0.0061065 -0.7507681 -0.0058815 0.2200572 -0.0001884 -0.1582217 0.281486 -0.0001032 0.0001118 -0.0002338 0.0487183 0.4401291 -0.0808486 -0.0001479 -0.1495333 0.0405581 -0.0000042 -0.0005454 0.0001794 0.0111558 -0.1141202 0.5277847 -0.0000469 0.6006135 -0.0088031 0.0000039 -0.0001465 0.0002293 0.0556243 -0.0388057 0.1305489 0.0000258 -0.0867814 -0.3985541 -0.0000766 -0.0001294 0.0000362 0.0105695 -0.2831206 -0.4967633 0.000418 0.0972057 -0.1159166 -0.0003329 0.0003413 -0.0004752 -0.2344463 1.4770131 0.4958739 -0.0000008 0.3710542 1.313748 0.0000095 0.001536 0.0008745 0.1835543 0.6915665 -0.5991508 -0.0001871 -0.4114466 0.9644533 -0.0001614 0.0003975 -0.0003589 -0.1194686 -0.2851788 0.1338923 0.0001222 0.2078831 -0.0008653 0.0000559 0.0001229 0.0000486 -0.145889 0.6602184 0.8214577 -0.0009537 1.2409795 1.0027086 -0.0015452 -0.0011749 -0.00134 0.1543503 -0.0788872 -0.0499376 0.0000185 0.2210821 0.0592291 -0.0000651 0.0000499 -0.0000532 -0.1052661 -0.2418409 0.2485966 -0.0001106 -0.5826659 -0.4933576 0.000136 -0.0006901 -0.0001349 -0.162542 0.1134576 -0.0451957 -0.0000202 -0.0323813 0.1544108 0.0000728 -0.0000163 0.0000508 -0.1392706 0.0762314 0.0160348 0.0000526 -0.1217857 -0.1515774 0.0000222 0.0000811 0.0000231 -0.1659082 0.0868322 0.0667672 -0.0000296 0.0363948 -0.0946077 0.0001702 -0.0001518 0.0003567 0.1565415 0.2364152 -0.0241621 0.0000372 -0.0476662 0.1953742 0.0000026 -0.0000294 -0.0000935 0.3022832 0.0423967 -0.1236012 -0.0000457 -0.078413 -0.0345781 -0.0000503 0.000063 -0.0000407 0.1441706 0.0867088 -0.0241072 0.0000159 -0.1033121 0.0414497 0.0000093 -0.0000619 0.0000539 0.1545987 -0.0719946 0.0016187 -0.0000031 -0.0083956 0.0926717 0.0000832 0.0000295 -0.000064 0.1692994 0.0365892 0.0782862 0.0000085 0.1101985 -0.08735 -0.0000332 -0.0000084 -0.0000377 0.1549508 -0.132047 0.0288228 -0.0000318 0.0225988 0.0865649 -0.0000086 -0.0000498 -0.0000237 0.1609521 0.1258719 0.0341474 0.0004089 0.0832176 0.2041256 -0.0008265 -0.0014321 -0.003012 0.3873595 0.2129589 0.0722193 -0.0004688 0.048835 0.1582408 -0.0002175 -0.0023958 -0.0014174 0.3905417 unknown
polarizability: 278.9588731|-4.8339586|220.165719|-0.0230838|-0.0058952|63.9472462 unknown
InChI: InChI=1S/C13H9BrN2O/c14-11-6-7(15)5-10-8-3-1-2-4-9(8)13(17)16-12(10)11/h1-6,16H,15H2
charge 0 multiplicity 1
26 atoms
Br -3.160663 2.764629 0.000318
O  1.974113 2.919987 0.000777
N  -0.1128 1.903639 -0.000471
N  -3.60111 -2.558444 0.001925
C  -0.441425 -0.531623 -0.000007
C  1.027115 -0.683888 -0.000299
C  -0.976449 0.799047 -0.000129
C  1.860904 0.480224 -0.000299
C  -1.331375 -1.633903 0.000743
C  1.286207 1.8507 -0.000856
C  -2.387596 0.953565 0.000312
C  1.667273 -1.957516 -0.00044
C  -2.736887 -1.461907 0.000713
C  3.27406 0.361942 -0.000135
C  -3.264906 -0.135563 0.000399
C  3.068168 -2.066773 -0.000338
C  3.882279 -0.903401 -0.000148
H  -0.93138 -2.652596 0.001965
H  -0.5224 2.844309 -0.000351
H  1.070083 -2.874216 -0.000661
H  3.859097 1.287359 -0.000146
H  -4.346575 0.029339 0.000481
H  3.533465 -3.058739 -0.000449
H  4.973446 -0.994363 -0.000055
H  -3.23845 -3.506825 -0.003025
H  -4.608292 -2.430583 -0.000726
