program: Gaussian 09
title: 000278045
version: EM64L-G09RevD.01
frameworkgroup: C1[X(C13H7Br3N2O)]
method: RPBEPBE
basis: SDD
operation: Freq
keyword: #p
keyword: freq=noraman
keyword: PBEPBE/SDD
title: #p freq=noraman PBEPBE/SDD
converged: YES YES NO NO
title: Mulliken charges:
elementType: Br Br Br O N N C C C C C C C C C C C C C H H H H H H H
charge: 0.023104 0.036024 0.026135 -0.256354 -0.440331 -0.698430 0.422196 0.340429 0.297011 0.096107 -0.671654 -0.021068 -0.435175 -0.340875 0.865163 -0.284588 -0.540534 -0.204100 -0.241045 0.340223 0.254354 0.235557 0.296848 0.253943 0.323497 0.323565
chargesum: 0.00000
title: Mulliken charges with hydrogens summed into heavy atoms:
elementType: Br Br Br O N N C C C C C C C C C C C C C
charge: 0.023104 0.036024 0.026135 -0.256354 -0.100109 -0.051369 0.422196 0.340429 0.297011 0.096107 -0.671654 -0.021068 -0.180821 -0.105318 0.865163 0.012261 -0.540534 0.049843 -0.241045
polarizability: 4.06939913e+02 -2.01726307e+00 2.28995589e+02 4.13676704e+00 -8.10853965e+00 7.56979921e+01
1716.lowfreq: -4.5193 -3.4044 -0.0004 -0.0003 0.0001 3.0032 22.2204 42.6046 75.1837
frequency: 22.2149 42.5994 75.1837 84.3818 102.2126 137.8005 149.8374 163.9063 170.4837 207.3800 224.3867 242.8457 297.6570 311.6945 332.3509 335.9539 382.7256 391.8793 424.9934 437.6357 463.7407 486.1772 494.9280 507.9522 523.5570 534.9144 604.2778 644.2886 659.0752 668.6840 675.8878 718.4448 746.6357 757.4306 785.6985 787.9150 831.8120 861.4815 880.0051 934.7988 942.5003 970.9593 1030.0101 1073.1766 1083.3220 1096.3725 1160.6830 1219.2884 1236.4212 1276.8414 1281.2229 1307.4450 1366.0511 1378.6305 1385.1096 1400.8887 1431.1478 1468.9091 1484.0704 1540.2184 1554.3478 1591.1141 1603.5923 1628.1871 1633.0800 3156.6189 3165.1447 3167.6771 3216.2539 3519.4666 3539.9213 3681.4143
redmass: 21.3735 9.0076 6.5663 10.9761 11.1386 14.6252 8.0160 15.7245 14.3081 6.7826 7.6602 13.6096 8.2643 4.9999 7.1564 6.5751 5.2646 5.7923 3.2100 1.1555 1.2314 5.6111 6.9274 6.1989 4.7055 3.4662 6.0977 2.6111 5.7533 4.7342 7.0291 2.2957 7.3533 5.0683 3.4242 7.4378 1.6641 1.5445 6.0294 7.1425 1.4283 1.3670 2.1837 2.3853 2.3334 4.7802 1.7466 2.3434 1.4507 1.5289 3.9859 3.1881 4.3121 7.6256 4.6012 4.7729 3.0567 3.0014 4.5189 7.2547 7.0221 4.4635 2.4372 3.2265 2.9089 1.0926 1.0916 1.0927 1.0923 1.0764 1.0452 1.1038
irintensity: 0.4031 0.5717 0.5110 0.8451 0.2253 0.1982 0.1612 0.6692 0.1169 8.4200 1.7796 1.5952 11.5732 2.4532 4.0196 11.8142 0.0223 2.5000 6.1407 2.1984 266.3339 1.3717 7.5219 18.9013 5.5928 3.5344 22.6991 22.7956 28.2586 9.6290 30.8732 22.6659 18.2388 72.3764 0.5517 35.6812 24.9679 34.2387 45.5418 14.6732 12.0595 1.5782 94.1840 30.2052 12.4138 8.8914 2.8942 17.9720 49.0196 11.8581 100.2319 11.7940 14.3604 90.6438 13.0608 20.7357 97.0204 46.5978 197.8216 20.5753 53.5411 34.9961 141.0607 600.7542 19.6359 1.7883 1.4147 5.1993 4.0408 41.7112 100.9386 51.1368
temp: 298.150 k
press: 1.00000 atm
elementType: 35 35 35 8 7 7 6 6 6 6 6 6 6 6 6 6 6 6 6 1 1 1 1 1 1 1
symmnumber: 1
zpe: 446780.8 jmol-1
zpe.correction: 0.170170 hartree
zpe.thermalcorrener: 0.186985 hartree
zpe.thermalcorrenthalpy: 0.187929 hartree
zpe.thermalcorrgfe: 0.122866 hartree
zpe.sumelectzpe: -723.424810 hartree
zpe.sumelectthermal: -723.407995 hartree
zpe.sumelectthermalent: -723.407050 hartree
zpe.sumelectthermalfe: -723.472113 hartree
dipole: -4.7997 3.1808 -0.8217
dipole: 5.8163
quadrupole: -135.3191 -134.6312 -142.4427
quadrupole: 7.0521 -2.3352 0.5802
quadrupole: 2.1452 2.8331 -4.9784 7.0521 -2.3352 0.5802
hfenergy: -723.5949798 hartree
pointgroup: C01 [X(C13H7Br3N2O1)]
dipole: -1.9820847 -1.1213519 0.2242544 debye
dipolederiv: -0.1147983 0.0704338 0.0299244 0.0166347 -0.5421726 -0.1287605 -0.0004491 -0.1486905 -0.0509342 -0.7761489 0.1779136 0.0701923 0.2047511 -0.1279979 -0.0315762 0.075253 -0.0248424 -0.0162374 -0.9589528 0.1240934 0.0045752 0.1162962 -0.0613727 0.0034605 0.0062576 0.002812 -0.0243465 -0.8941294 -0.4092057 0.0469578 -0.5807195 -1.1863556 0.0929197 0.0778413 0.0658062 -0.3716165 -1.0338195 -0.6181376 0.0416256 0.0841422 -0.4795206 -0.0052198 0.0911088 0.0587513 -0.2919488 -1.0941217 -0.591373 -0.038709 -0.9016756 -0.7481535 0.0340089 -0.0691208 0.0134839 -0.6591643 0.0084348 0.2809991 0.0889141 -0.1761461 -0.0978178 -0.0256126 0.0950069 -0.0639397 0.0625547 0.3855387 0.0037597 0.0105866 -0.1816884 0.0764381 -0.0191123 0.0624636 -0.0217728 0.0080723 0.0352765 0.4718508 -0.0013368 0.3277172 0.3553022 -0.0227054 -0.0153799 -0.0814927 0.0440553 0.1473157 0.0931464 -0.0165059 0.0103796 -0.4103435 0.0507626 -0.0591109 0.0483837 0.0072186 -0.0182664 -0.6573882 -0.1353193 0.2229717 0.8157012 0.2810447 -0.0469392 0.2958968 -0.1287614 1.4028803 0.5920274 -0.1135292 0.2769872 1.3301018 -0.1218132 -0.1731126 -0.1443526 0.2028473 -0.0457282 -0.2783298 -0.0127831 0.2594053 -0.0684315 -0.029205 0.0052227 0.0182642 -0.0920885 -0.2179264 0.0726905 -0.0437328 0.0166536 -0.0081287 -0.0461481 -0.0498355 -0.0052889 -0.107476 0.354516 0.933287 0.1184777 1.2873419 0.2206032 -0.0909242 0.1493605 -0.038117 0.1866379 -0.603294 0.0540831 0.0084527 0.3419152 -0.035159 -0.0043796 -0.0318079 0.00709 -0.0469739 1.1099001 -0.1675177 -0.1150033 -1.0796304 0.1729682 0.102166 -0.2037535 0.0485572 -0.1655291 -0.3364781 -0.0508662 0.0173435 0.054567 0.0842535 -0.0418366 0.0265987 -0.0358423 -0.0711751 1.6339862 -0.2065373 -0.0261848 -0.4038631 -0.0019506 -0.0118443 -0.0046243 -0.0081781 -0.1379276 0.1150035 0.0089297 0.0168805 -0.0142889 0.196236 -0.0000925 0.0157748 0.0248495 0.3127656 0.0983318 -0.0000578 0.0051111 0.0359558 -0.0423398 -0.0160193 0.0152146 -0.0066722 0.1665134 0.1006682 -0.0338703 0.0438815 -0.0092 0.0131186 0.0301158 0.0255303 0.0229714 0.1426075 0.1158079 -0.0120754 0.0029869 -0.0944075 0.0923785 0.009331 0.0188179 0.0006455 0.1545191 0.0649653 0.0499325 -0.0108179 0.0711851 -0.0164391 0.0312195 -0.0093035 0.0272036 0.1499188 0.246466 0.0462915 0.0014466 0.0851932 0.2278527 -0.0262117 0.0018662 -0.0313094 0.3614581 0.2745726 0.0459202 0.0065655 0.0295226 0.2412287 -0.0135672 -0.0028797 -0.0242169 0.3650108 unknown
polarizability: 405.9919305|-11.786801|229.8095699|-8.3858934|8.1313932|75.8319945 unknown
InChI: InChI=1S/C13H7Br3N2O/c14-5-1-2-6-7(3-5)13(19)18-9-4-8(15)12(17)11(16)10(6)9/h1-4,18H,17H2
charge 0 multiplicity 1
26 atoms
Br -1.273911 -3.081006 -0.651209
Br -5.263159 0.964625 0.330823
Br 5.674748 -0.932498 -0.014126
O  1.983831 3.13305 -0.28056
N  -0.124067 2.210807 0.018192
N  -4.011184 -1.874949 -0.134826
C  -0.593137 -0.214367 -0.039807
C  0.876293 -0.428485 0.000514
C  -1.043715 1.148934 0.053415
C  1.755515 0.702888 -0.123801
C  -1.62987 -1.196592 -0.154243
C  1.255265 2.100255 -0.16063
C  -2.415502 1.476315 0.163418
C  1.506943 -1.690757 0.220261
C  -3.027558 -0.906625 -0.045552
C  3.165504 0.557593 -0.136931
C  -3.374842 0.467958 0.146858
C  2.90439 -1.839941 0.226692
C  3.729763 -0.71217 0.016228
H  -0.481541 3.169751 0.062876
H  -2.720385 2.522824 0.259361
H  0.910504 -2.579351 0.417402
H  3.767594 1.464415 -0.246341
H  3.345437 -2.825414 0.401013
H  -3.765481 -2.849469 -0.286661
H  -4.990735 -1.607189 -0.078067
