program: Gaussian 09
title: 000278172
version: EM64L-G09RevD.01
frameworkgroup: C1[X(C23H31NO4)]
method: RPBEPBE
basis: SDD
operation: Freq
keyword: #p
keyword: freq=noraman
keyword: PBEPBE/SDD
title: #p freq=noraman PBEPBE/SDD
converged: YES YES NO NO
title: Mulliken charges:
elementType: O O O O N C C C C C C C C C C C C C C C C C C C C C C C H H H H H H H H H H H H H H H H H H H H H H H H H H H H H H H
charge: -0.303214 -0.301454 -0.287550 -0.288067 -0.104953 -0.184466 -0.482733 0.351056 -0.570868 0.360093 -0.665974 -0.332313 -0.574826 -0.405115 -0.548992 0.572502 0.191408 0.192952 -0.665313 -0.615048 -0.367050 0.244921 -0.340530 0.168481 -0.531297 -0.530808 -0.534999 -0.522378 0.226254 0.226218 0.223348 0.229988 0.223844 0.230554 0.228363 0.193995 0.209569 0.257647 0.204443 0.198834 0.256704 0.206878 0.222918 0.213841 0.239782 0.253973 0.248571 0.254158 0.219727 0.227814 0.228096 0.253541 0.221220 0.225053 0.242112 0.218815 0.226320 0.255858 0.208097
chargesum: 0.00000
title: Mulliken charges with hydrogens summed into heavy atoms:
elementType: O O O O N C C C C C C C C C C C C C C C C C C C C C C C
charge: -0.303214 -0.301454 -0.287550 -0.288067 -0.104953 0.041788 -0.033168 0.351056 -0.117036 0.360093 -0.207057 0.071251 -0.317179 -0.001838 -0.292288 0.572502 0.191408 0.192952 -0.021676 -0.375266 -0.113078 0.244921 -0.091960 0.168481 0.170402 0.172049 0.150981 0.167897
polarizability: 3.64322298e+02 8.96387594e+00 3.04258850e+02 8.89055211e+00 -1.61324564e+01 1.72504132e+02
1716.lowfreq: -11.7848 -6.0666 -3.2215 0.0005 0.0007 0.0009 3.3333 17.9543 29.4555
frequency: -9.1475 17.9372 29.4245 36.3846 44.6329 56.3725 65.0958 72.6380 92.3725 102.3424 107.5748 115.9634 120.2262 132.5269 149.9073 161.9389 165.8511 168.4027 176.5571 190.3018 202.7073 203.1934 213.3826 242.3927 265.5824 269.6638 276.7009 281.0121 299.7907 313.0161 332.7838 338.9597 371.4312 380.5068 396.3547 411.3244 432.9891 456.7816 483.1831 484.5714 488.7939 506.1604 525.7998 542.6723 546.1180 594.8767 616.6408 637.1356 662.8623 697.7124 707.3133 713.5728 721.8569 732.5401 738.3752 746.9724 795.8718 803.4510 832.8915 850.7052 864.1647 867.9977 887.8993 896.1382 901.8913 914.5802 920.0084 943.6235 949.3316 958.9270 960.7351 962.2747 992.7441 1003.5686 1019.0891 1052.2374 1071.4629 1088.7616 1096.3133 1108.0524 1110.5731 1110.7989 1113.5043 1114.2277 1121.5890 1143.1604 1146.4382 1149.5244 1155.5255 1156.0885 1159.8791 1161.4561 1174.7591 1193.4648 1202.7315 1208.7063 1233.4186 1236.3059 1257.7949 1261.3979 1267.3571 1269.1446 1273.4083 1275.5843 1304.2702 1311.8891 1344.2423 1349.4276 1351.8488 1365.7692 1375.9799 1380.3337 1388.1739 1396.9650 1401.9642 1423.4329 1426.2658 1442.1479 1443.8091 1449.9341 1454.1199 1456.8911 1458.4604 1459.8070 1465.3053 1466.5391 1469.6051 1472.7757 1477.9364 1480.7845 1481.7507 1482.1673 1485.1169 1488.6405 1488.7344 1497.3274 1566.5997 1581.7346 1608.2189 1614.0933 2859.8332 2957.9929 2963.1164 2969.0973 2969.4037 2971.2445 2974.9551 2982.1212 2987.6173 2993.6582 2997.8511 3004.1154 3023.0053 3025.4359 3045.4036 3049.8649 3059.7867 3065.6650 3067.4000 3074.2779 3076.2135 3084.2774 3118.0926 3119.0434 3120.0001 3120.9513 3127.9346 3136.0055 3136.1781 3149.4045 3172.5235
redmass: 4.2794 4.5597 4.3904 3.6951 3.6333 2.8997 2.3397 3.0746 3.3733 2.8920 2.7024 2.2759 3.2766 3.6453 2.3083 1.3464 1.0784 1.8186 2.5589 2.1359 3.2132 1.9549 1.7207 3.3558 3.0116 1.9233 4.9929 2.6550 3.4345 2.4465 3.4988 3.6055 2.7364 3.5016 3.7109 3.6297 3.3075 3.8803 3.7801 3.4735 3.5076 4.3993 3.9437 4.7222 3.4216 4.1488 4.1488 3.9753 4.3963 3.7182 4.1252 5.3033 4.1851 3.1077 3.2964 2.7602 1.9777 1.7630 1.6713 1.8737 2.3358 2.1897 1.5798 1.8486 1.6134 3.5368 2.1672 1.4895 3.6441 3.6923 4.7733 2.4487 2.6954 4.2568 3.2013 1.7678 4.3666 2.4274 2.5957 2.1680 1.2526 1.2475 1.2427 1.2446 1.9208 1.6220 1.4732 1.4886 1.4039 1.4680 1.6331 1.4806 2.9810 1.4044 1.5850 1.9184 1.2886 1.4303 1.5729 2.1030 3.1694 1.3266 1.5970 1.5556 1.4043 1.5630 1.3162 1.4255 1.5562 3.8505 4.6986 1.9796 1.8611 1.3439 2.2489 1.1747 1.1984 1.3265 1.2927 1.1175 1.0711 1.0524 1.0797 1.0813 1.0540 1.1097 1.0584 1.1097 1.0561 1.1228 1.0557 1.0622 2.4011 1.0599 1.1055 2.5850 8.1704 7.6382 6.5074 7.1708 1.0703 1.0329 1.0636 1.0349 1.0311 1.0313 1.0593 1.0385 1.0726 1.0666 1.0716 1.0882 1.0938 1.0975 1.1038 1.1006 1.1004 1.1031 1.1034 1.1000 1.0968 1.0994 1.1028 1.1027 1.0994 1.1042 1.0906 1.0902 1.0915 1.0881 1.0961
irintensity: 0.8821 0.0238 0.1630 0.2132 0.2067 2.0827 2.4927 2.5596 8.3847 3.0770 5.4285 1.3365 1.1606 4.2690 2.0469 0.6629 0.0104 3.0339 1.8005 2.5289 1.5924 0.1957 0.6175 1.7886 10.3747 2.9577 6.9112 0.7259 1.9112 2.1019 0.2597 3.4885 2.1098 1.3971 1.8254 3.7296 7.6298 1.2246 4.6025 3.8743 5.8877 16.4047 4.9639 7.5893 1.2734 10.5160 9.5077 31.6996 15.8431 9.7766 3.7641 9.6070 8.6836 1.3074 8.2750 9.2339 3.6075 25.9073 14.3826 10.5644 3.6410 2.6210 2.3798 3.2295 53.3960 10.4580 11.7041 5.5993 38.9280 62.0812 36.6685 9.1725 22.6446 51.2933 29.7588 13.3987 69.1377 20.8585 2.0209 98.3407 6.2242 5.9245 13.9297 1.6933 11.6397 9.1991 9.2552 5.9989 3.4486 10.4780 27.0074 14.7460 33.0199 14.6513 1.4151 72.8903 12.6953 16.2362 40.8967 86.7721 126.3233 20.3308 38.7912 24.3540 8.0102 5.1358 2.5900 5.1183 16.7240 5.7293 17.1140 13.4505 8.0501 4.8925 28.9295 0.3790 4.1544 7.8224 10.7190 13.6856 10.7261 13.8415 9.3230 3.7252 19.6008 5.8519 6.0562 88.9789 4.8303 26.7456 27.1323 8.3925 136.0338 11.6177 63.2010 149.3875 1.0133 14.9969 13.2528 1.4860 93.6934 57.2641 31.5679 99.8949 102.7683 62.2111 48.1109 21.6741 4.0183 20.7198 32.6077 24.3171 56.2955 34.8151 46.4562 21.9681 39.6257 31.8247 24.2355 67.0996 38.7178 57.7490 24.3565 29.1182 26.3676 23.0275 10.5507 10.8916 6.3527 6.4726 5.3505
temp: 298.150 k
press: 1.00000 atm
elementType: 8 8 8 8 7 6 6 6 6 6 6 6 6 6 6 6 6 6 6 6 6 6 6 6 6 6 6 6 1 1 1 1 1 1 1 1 1 1 1 1 1 1 1 1 1 1 1 1 1 1 1 1 1 1 1 1 1 1 1
symmnumber: 1
zpe: 1295539.4 jmol-1
zpe.correction: 0.493445 hartree
zpe.thermalcorrener: 0.522123 hartree
zpe.thermalcorrenthalpy: 0.523068 hartree
zpe.thermalcorrgfe: 0.433482 hartree
zpe.sumelectzpe: -1248.486474 hartree
zpe.sumelectthermal: -1248.457796 hartree
zpe.sumelectthermalent: -1248.456851 hartree
zpe.sumelectthermalfe: -1248.546437 hartree
dipole: -2.4259 -1.7107 -0.5982
dipole: 3.0281
quadrupole: -168.2881 -143.7610 -169.8302
quadrupole: -7.3289 -8.8651 0.5367
quadrupole: -7.6617 16.8654 -9.2037 -7.3289 -8.8651 0.5367
hfenergy: -1248.9799189 hartree
pointgroup: C01 [X(C23H31N1O4)]
dipole: 0.9588084 -0.6681648 0.2313781 debye
polarizability: 363.7200797|-9.283579|301.3658774|15.4710319|24.0897613|175.9993235 unknown
InChI: InChI=1S/C23H31NO4/c1-6-10-24-11-9-17-14-22(27-4)23(28-5)15-18(17)19(24)12-16-7-8-20(25-2)21(13-16)26-3/h7-8,13-15,19H,6,9-12H2,1-5H3
charge 0 multiplicity 1
59 atoms
O  3.916304 -2.620131 -0.786238
O  5.910412 -0.767711 0.314162
O  -4.444782 -2.707324 -0.954582
O  -6.089635 -0.389375 -0.782548
N  0.071572 2.210738 0.075576
C  0.318549 0.750889 -0.090006
C  0.839727 2.760509 1.220147
C  1.808193 0.365649 0.02497
C  2.373141 2.657002 1.023724
C  2.774507 1.259341 0.566452
C  -0.562911 -0.0884 0.903807
C  0.210488 2.970042 -1.197508
C  2.226391 -0.918319 -0.40414
C  -0.231991 4.447161 -1.101942
C  4.129174 0.849998 0.638302
C  -2.022982 -0.182025 0.488781
C  3.568944 -1.328849 -0.314371
C  4.542293 -0.41938 0.192931
C  -1.69032 4.633388 -0.633575
C  -2.541163 -1.409621 0.000136
C  -2.88681 0.938238 0.553015
C  -3.886503 -1.527381 -0.421608
C  -4.234681 0.822296 0.151144
C  -4.75531 -0.397036 -0.331173
C  4.448953 -3.527145 0.256983
C  6.592419 -1.031088 -0.974472
C  -3.552603 -3.851798 -1.143927
C  -6.994216 -1.429804 -0.253403
H  -0.020866 0.48149 -1.10958
H  0.540738 3.809327 1.389444
H  0.550248 2.196318 2.127164
H  2.701816 3.401088 0.269069
H  2.895711 2.918231 1.964297
H  -0.133203 -1.104552 0.972315
H  -0.470393 0.360013 1.911424
H  1.253221 2.934954 -1.602766
H  -0.434846 2.461311 -1.940053
H  1.505424 -1.631523 -0.821898
H  -0.105319 4.890558 -2.11001
H  0.451727 5.012109 -0.436859
H  4.894399 1.526006 1.037298
H  -1.973517 5.702178 -0.630141
H  -1.833476 4.232944 0.385485
H  -2.389151 4.093957 -1.299586
H  -1.875067 -2.277702 -0.054827
H  -2.490559 1.896267 0.900833
H  -4.918091 1.67635 0.198997
H  5.340588 -3.091174 0.742932
H  3.670999 -3.730703 1.017668
H  4.711167 -4.45817 -0.268749
H  7.617861 -1.329832 -0.707943
H  6.084933 -1.838102 -1.533326
H  6.616323 -0.109533 -1.586986
H  -2.713055 -3.598452 -1.820166
H  -4.17795 -4.630473 -1.605564
H  -3.152467 -4.219728 -0.178694
H  -7.977877 -1.198746 -0.690793
H  -6.660737 -2.4360 -0.55565
H  -7.051639 -1.366768 0.851231
