program: Gaussian 09
title: 000278031
version: EM64L-G09RevD.01
frameworkgroup: C1[X(C13H9ClN2O)]
method: RPBEPBE
basis: SDD
operation: Freq
keyword: #p
keyword: freq=noraman
keyword: PBEPBE/SDD
title: #p freq=noraman PBEPBE/SDD
converged: NO YES NO NO
title: Mulliken charges:
elementType: Cl O N N C C C C C C C C C C C C C H H H H H H H H H
charge: -0.050317 -0.267868 -0.430677 -0.708982 0.314528 0.313899 0.266495 0.119348 -0.596351 -0.022013 -0.366241 -0.380093 -0.322599 0.537755 -0.452538 -0.228210 -0.120008 0.328459 0.211463 0.226495 0.228066 0.301724 0.225172 0.256080 0.309104 0.307310
chargesum: 0.00000
title: Mulliken charges with hydrogens summed into heavy atoms:
elementType: Cl O N N C C C C C C C C C C C C C
charge: -0.050317 -0.267868 -0.102219 -0.092568 0.314528 0.313899 0.266495 0.119348 -0.384887 -0.022013 -0.139746 -0.152026 -0.020875 0.537755 -0.227367 0.027871 -0.120008
polarizability: 3.02561557e+02 -9.43421046e+00 1.87233508e+02 -8.98535333e-03 -3.68964000e-03 6.32591537e+01
1716.lowfreq: -7.1016 -6.1914 -1.6377 -0.0023 -0.0014 0.0003 56.9417 67.2331 135.3841
frequency: 56.9368 67.2326 135.3838 142.4950 162.8783 188.7954 221.5845 302.5305 305.8676 332.1503 342.7381 348.8813 366.7117 374.6436 422.8795 430.7806 453.7435 491.6193 497.7601 512.5482 574.9262 610.6020 627.3078 652.8396 653.7358 718.7847 719.8815 735.1088 779.9741 793.7427 813.1746 828.2714 864.9772 866.0454 897.6817 933.5855 936.6682 958.3858 1006.5301 1047.7552 1071.5550 1098.2578 1141.1726 1159.7465 1227.3531 1246.8863 1260.9294 1275.9694 1299.9169 1338.3480 1378.5110 1384.9922 1414.9853 1418.7105 1446.6906 1491.5293 1509.7903 1556.4847 1591.9581 1604.1110 1624.2655 1640.1421 1652.4589 3121.7759 3137.5031 3146.2809 3151.7875 3169.1751 3173.7460 3518.8690 3571.7254 3711.0783
redmass: 6.9586 5.1460 8.4560 5.1178 5.6781 5.2172 7.7516 7.1568 4.6574 8.1845 1.0701 1.2023 5.3440 5.0736 3.1559 4.6321 3.4673 7.3775 6.5545 3.1061 6.1814 3.2005 6.4241 2.1967 7.1883 6.3091 2.2068 2.3631 3.0374 7.1650 1.5553 1.6886 2.0224 4.4639 5.6541 1.3727 1.4200 1.3669 2.4086 1.6591 1.8380 5.4987 1.6901 1.2436 1.6763 1.8648 1.6102 2.2770 2.6857 2.3639 3.7614 8.2406 3.1400 5.1088 2.9201 3.8091 3.8619 7.2809 6.8930 6.6990 5.5677 1.3455 3.6236 1.0871 1.0909 1.0968 1.0873 1.0929 1.0969 1.0764 1.0451 1.1040
irintensity: 0.1571 0.5028 0.9221 0.3452 0.0599 9.3217 0.2182 0.2375 0.1149 5.7731 46.3929 243.1273 4.2109 28.8193 7.6533 9.4275 4.4790 5.8096 23.1332 0.0282 14.1380 15.1017 9.8100 21.4394 5.7516 3.7598 31.7786 29.5447 2.6439 27.5893 58.1750 62.7760 25.2721 15.6654 15.4346 0.0965 13.6225 1.5943 4.3400 0.7161 5.8130 14.1104 13.2483 15.4249 11.7892 63.6086 23.6242 3.1472 25.3963 60.2632 15.4266 57.7861 28.6728 13.2287 52.9915 90.1035 129.8148 2.5228 22.7624 176.8041 398.6241 106.0200 130.4194 11.4868 12.5914 19.2917 11.0332 2.6855 10.9885 36.2463 96.0008 21.2780
temp: 298.150 k
press: 1.00000 atm
elementType: 17 8 7 7 6 6 6 6 6 6 6 6 6 6 6 6 6 1 1 1 1 1 1 1 1 1
symmnumber: 1
zpe: 500726.0 jmol-1
zpe.correction: 0.190716 hartree
zpe.thermalcorrener: 0.204318 hartree
zpe.thermalcorrenthalpy: 0.205262 hartree
zpe.thermalcorrgfe: 0.150514 hartree
zpe.sumelectzpe: -1144.461477 hartree
zpe.sumelectthermal: -1144.447876 hartree
zpe.sumelectthermalent: -1144.446932 hartree
zpe.sumelectthermalfe: -1144.501680 hartree
dipole: 6.9791 -4.2969 0.0230
dipole: 8.1958
quadrupole: -89.6571 -97.3976 -110.7674
quadrupole: 1.4702 0.0904 -0.0485
quadrupole: 9.6169 1.8765 -11.4934 1.4702 0.0904 -0.0485
hfenergy: -1144.6521934 hartree
pointgroup: C01 [X(C13H9Cl1N2O1)]
dipole: -2.8172403 -1.5685582 -0.0069485 debye
dipolederiv: -1.0218289 0.1803211 0.0017805 0.1553115 -0.1444704 -0.0003672 0.0016116 -0.0004345 -0.0673801 -0.9000073 -0.4126053 0.000908 -0.5952122 -1.1865971 0.0003781 -0.0029021 -0.0031206 -0.3740412 -0.9246084 -0.5973142 -0.0005433 0.1151051 -0.4024455 -0.0005113 0.001478 0.0009069 -0.2829697 -1.0055268 -0.6960203 0.0008504 -1.0684751 -0.8444239 0.0045704 0.0073884 0.008229 -0.7538772 -0.0062343 0.1629437 0.0002865 0.0097557 0.1490522 0.0000907 0.0002479 -0.0003289 0.0337178 0.4488898 -0.083946 -0.0011186 -0.1740458 0.0243022 0.0002671 -0.0018189 0.0005042 0.0121398 -0.0022902 0.4982946 0.0011775 0.2725671 0.2714759 -0.0001985 0.000507 -0.00072 0.0371922 0.0658853 0.1267497 0.0001878 -0.1227802 -0.3879639 -0.0005868 -0.0007356 -0.0007678 0.0100673 -0.3294064 -0.4531911 -0.0004237 0.1128902 -0.0371194 -0.0000808 0.0003065 0.0005813 -0.232537 1.3445388 0.5608457 -0.0013582 0.3397866 1.3151485 0.0011301 0.0020304 0.0030451 0.1753126 -0.1699911 0.0808345 0.0002289 0.1511561 0.029722 -0.0000127 0.0003844 0.0001282 -0.1390951 0.3340717 -0.2483515 -0.0015735 0.1038543 0.078466 0.000227 -0.0006632 0.0014411 -0.152613 -0.4028525 -0.0074311 0.0005061 0.309659 -0.0380202 -0.0005874 0.0008773 0.0001385 -0.0644747 0.8146316 0.8605658 -0.000613 1.3382495 0.7621269 -0.002677 0.000132 -0.0012732 0.1470425 -0.1149523 0.0918876 -0.0002744 -0.7139612 -0.1607491 0.0015396 -0.0028033 -0.0002691 -0.2132218 -0.220885 0.0317149 0.0002263 0.0265697 0.0795117 0.0002459 0.0001895 0.0002175 -0.0962582 1.4173233 -0.2377857 -0.0026349 -0.3688587 0.0550966 0.0008241 -0.0025813 0.0006176 -0.0809645 0.1166806 0.011242 0.0005484 -0.0257779 0.1787595 -0.0002111 0.0003602 -0.0004631 0.3145559 0.0871603 0.0552681 0.0002326 0.0179338 -0.1019882 -0.0003776 0.0000039 -0.0003419 0.1546411 0.0149302 -0.1119802 0.000013 -0.0720148 -0.0167176 -0.0001501 0.0003022 -0.0001107 0.1436752 0.0752778 0.016578 0.0002072 0.0750315 -0.107424 -0.0007083 0.0003588 -0.0005604 0.1618569 0.1069206 -0.0123562 0.0000961 -0.0864564 0.0975247 0.0000788 -0.0001247 -0.0000483 0.1620883 -0.1491075 0.0264146 0.0006901 0.0005577 0.0794304 -0.0001045 0.0007675 -0.0004189 0.1660493 0.067734 0.057219 0.0002459 0.0636225 -0.023379 -0.0003926 0.0001848 -0.0003609 0.1613249 0.2210311 0.0557669 -0.0004675 0.0468049 0.1450204 -0.000696 -0.0037672 -0.0022739 0.389852 0.1326154 0.0443354 0.0008218 0.088727 0.1856612 -0.0016899 -0.0017343 -0.004317 0.3879167 unknown
polarizability: 303.1654244|4.3494814|186.6285484|-0.4112622|0.2114092|63.2602467 unknown
InChI: InChI=1S/C13H9ClN2O/c14-7-1-3-9-10-6-8(15)2-4-12(10)16-13(17)11(9)5-7/h1-6,16H,15H2
charge 0 multiplicity 1
26 atoms
Cl 5.098755 -1.149947 -0.010539
O  1.649212 3.039848 0.003565
N  -0.49674 2.147457 0.003668
N  -4.267088 -2.063729 0.004643
C  -0.971232 -0.261517 0.000346
C  0.482598 -0.503345 -0.002727
C  -1.429414 1.092175 0.003806
C  1.383666 0.610685 -0.002499
C  -1.93798 -1.301209 0.000701
C  0.894547 2.01595 -0.000569
C  1.050797 -1.811232 -0.00561
C  -2.818826 1.372613 0.00753
C  2.7892 0.419974 -0.00475
C  -3.328061 -1.029406 0.003716
C  -3.758414 0.333658 0.00734
C  2.441063 -2.008986 -0.007974
C  3.295673 -0.88175 -0.007462
H  -0.84051 3.112369 0.006632
H  -1.610736 -2.346368 -0.00083
H  0.404269 -2.693421 -0.005956
H  -3.161635 2.414311 0.010429
H  3.431795 1.305358 -0.004535
H  -4.82966 0.566308 0.010497
H  2.861715 -3.018616 -0.010155
H  -5.262133 -1.862769 0.00202
H  -3.975159 -3.036011 -0.004087
