program: Gaussian 09
title: 000278032
version: EM64L-G09RevD.01
frameworkgroup: C1[X(C13H8Br2N2O)]
method: RPBEPBE
basis: SDD
operation: Freq
keyword: #p
keyword: freq=noraman
keyword: PBEPBE/SDD
title: #p freq=noraman PBEPBE/SDD
converged: NO YES NO NO
title: Mulliken charges:
elementType: Br Br O N N C C C C C C C C C C C C C H H H H H H H H
charge: 0.017737 0.022444 -0.260151 -0.436536 -0.705496 0.333863 0.319450 0.284269 0.110747 -0.586136 -0.018795 -0.398290 -0.367246 0.740393 -0.287006 -0.551435 -0.190773 -0.239643 0.217741 0.335004 0.250195 0.227174 0.296216 0.252008 0.310003 0.324264
chargesum: 0.00000
title: Mulliken charges with hydrogens summed into heavy atoms:
elementType: Br Br O N N C C C C C C C C C C C C C
charge: 0.017737 0.022444 -0.260151 -0.101532 -0.071230 0.333863 0.319450 0.284269 0.110747 -0.368395 -0.018795 -0.148095 -0.140072 0.740393 0.009210 -0.551435 0.061235 -0.239643
polarizability: 3.91358780e+02 -1.24544290e+01 1.96374819e+02 4.28863933e-03 -9.29950569e-03 6.69829182e+01
1716.lowfreq: -3.6555 -3.6219 0.0002 0.0003 0.0003 0.4727 30.4735 61.8030 90.3883
frequency: 30.4635 61.8012 90.3881 93.3412 149.8944 164.1455 169.2319 180.9160 215.4811 247.3004 296.2859 308.6439 329.9975 367.0960 368.9744 392.6125 419.9607 427.8506 453.8146 484.8731 489.6654 500.7902 524.6317 588.4111 640.4422 647.1144 668.1107 672.0916 715.8160 719.0927 731.8449 782.0140 782.2312 830.1918 862.3640 863.8189 870.4621 924.4334 942.3198 964.8069 1022.7474 1053.1892 1072.0586 1092.5958 1153.5938 1227.6045 1235.9905 1252.1425 1279.0321 1296.2912 1311.5921 1376.9744 1381.6003 1409.0488 1412.8607 1439.3296 1482.8826 1505.4525 1549.3908 1579.7706 1599.1857 1621.5712 1629.3631 1646.9559 3140.8910 3151.0423 3152.5302 3167.5534 3173.9819 3519.3539 3556.3048 3700.3309
redmass: 14.2815 5.2692 14.7755 8.6754 5.1533 30.5093 11.4732 5.1826 6.2254 5.8555 8.0430 4.7932 8.7984 1.2006 6.2306 3.0843 1.6515 2.4902 2.6863 5.1607 6.7809 5.8264 3.2528 6.0650 7.1879 2.4956 4.2577 7.1365 2.3361 6.6242 1.9766 3.4244 7.2950 1.5997 1.5151 4.5459 2.2801 6.8899 1.4309 1.3715 2.8309 1.5508 1.9005 6.1891 1.6184 1.5164 1.8616 2.0798 2.4179 1.8314 2.4308 4.7356 7.1572 4.9938 4.2267 2.9905 3.6726 4.2530 7.9160 6.8565 6.5627 3.4490 1.9256 2.7566 1.0905 1.0917 1.0876 1.0927 1.0967 1.0764 1.0456 1.1034
irintensity: 0.0686 0.0161 0.2341 0.5217 0.1282 0.0659 1.1101 4.7933 5.0070 6.9013 2.5172 0.0019 8.2997 65.7677 1.0846 1.0109 213.2088 32.5099 3.3656 11.9145 0.5912 16.2103 3.7909 24.8272 4.5882 27.6188 8.8122 32.9504 8.4767 5.0026 49.1109 11.1667 26.0286 46.3128 42.9366 34.1756 20.4146 4.2486 10.5268 1.6299 87.0388 2.6327 20.0678 2.4455 11.1331 26.5424 33.8699 75.4613 14.6310 33.8972 4.0571 23.3844 74.1829 53.7774 32.3774 66.6968 94.2980 153.1610 3.9645 53.2387 145.4031 127.0694 407.3244 87.9829 7.1655 4.2531 5.7569 2.6558 11.0777 38.9868 107.1562 31.3580
temp: 298.150 k
press: 1.00000 atm
elementType: 35 35 8 7 7 6 6 6 6 6 6 6 6 6 6 6 6 6 1 1 1 1 1 1 1 1
symmnumber: 1
zpe: 473523.4 jmol-1
zpe.correction: 0.180356 hartree
zpe.thermalcorrener: 0.195661 hartree
zpe.thermalcorrenthalpy: 0.196606 hartree
zpe.thermalcorrgfe: 0.136084 hartree
zpe.sumelectzpe: -710.650265 hartree
zpe.sumelectthermal: -710.634959 hartree
zpe.sumelectthermalent: -710.634015 hartree
zpe.sumelectthermalfe: -710.694536 hartree
dipole: 4.1968 -4.9928 0.0047
dipole: 6.5223
quadrupole: -125.5379 -112.7573 -128.1195
quadrupole: 3.2138 0.0022 0.0202
quadrupole: -3.3996 9.3809 -5.9813 3.2138 0.0022 0.0202
hfenergy: -710.8306203 hartree
pointgroup: C01 [X(C13H8Br2N2O1)]
dipole: -1.8103528 -1.8186148 -0.0017826 debye
dipolederiv: -0.8435688 0.0911688 0.0003816 0.1509814 -0.0971776 -0.0002447 0.0005543 -0.0001325 -0.0235372 -0.9355584 0.130752 0.000034 0.1086225 -0.065188 -0.0000512 -0.0002492 -0.0000338 -0.0278028 -0.8948602 -0.3829989 0.0007387 -0.6043555 -1.2026337 0.0006538 -0.0032201 -0.0030257 -0.3671513 -1.0365751 -0.6063985 -0.000813 0.084187 -0.4457072 -0.0002871 0.0004738 0.0003488 -0.2846296 -0.8659386 -0.6528521 0.0022592 -0.9973468 -0.961703 -0.0007646 0.0022164 -0.0004392 -0.7101719 -0.068132 0.146844 0.0002858 -0.1206175 0.1357735 -0.0000204 -0.0003278 -0.0004217 0.0410186 0.5189324 -0.0670988 -0.0003659 -0.1739435 0.0400115 -0.000098 -0.000884 0.0005429 0.0204741 0.0474427 0.491783 0.0006773 0.2848953 0.3437289 -0.0000018 0.0007655 -0.0004421 0.0352637 0.060602 0.1318882 0.000125 -0.0568835 -0.4018057 -0.0001925 -0.0006121 -0.0000174 0.0104937 -0.1143235 -0.4670962 -0.0002277 0.2553245 -0.0727406 0.0007146 -0.0003728 0.0003468 -0.2162723 1.4022227 0.5453795 -0.0004962 0.3073831 1.3455877 0.0001581 0.0033857 0.0026124 0.179368 -0.056573 -0.2388654 -0.0004508 0.2411738 -0.0094146 -0.0001395 -0.0007991 0.0006885 -0.0863786 -0.2087207 0.0900605 -0.00006 0.1334598 0.0260717 -0.0001132 0.0000596 -0.0000682 -0.1396865 0.1863628 0.9369943 -0.0013659 1.2869207 0.8441622 -0.0008887 -0.0018476 -0.0011791 0.17374 -0.5203488 0.0346733 -0.0000223 0.3108344 -0.0155292 -0.0001311 -0.0000077 0.0001039 -0.0430869 1.2415007 -0.0904672 -0.0005447 -0.9920607 -0.0786054 0.00061 0.0012472 0.0008851 -0.191695 -0.3071493 -0.0110143 0.0000826 0.0488143 0.1003325 0.0000084 -0.0001107 -0.0000229 -0.07962 1.56962 -0.2033615 0.0001902 -0.3496258 -0.039939 0.0000139 0.0004611 0.0000382 -0.1452746 0.0552984 0.0638833 0.00028 0.0312933 -0.0824584 -0.0004766 0.0004916 -0.0003794 0.1554645 0.1146536 0.0060292 0.0002546 -0.0206229 0.1875993 -0.0000808 0.000108 -0.0002798 0.3160455 0.0883327 0.0185327 0.0000381 0.0522764 -0.0415564 -0.0001181 -0.0002018 -0.0001201 0.1670511 0.0105781 -0.109181 0.0000007 -0.0735929 -0.0210043 0.0000267 0.0002759 0.0000202 0.1450683 0.1137793 -0.0135885 -0.0000111 -0.0996097 0.0905257 0.0000465 -0.0001053 0.0000134 0.1551524 0.0639839 0.0611688 0.000005 0.0730125 -0.0234146 -0.000002 -0.0000844 0.0000354 0.156803 0.1312088 0.0540496 -0.0005063 0.1004745 0.2149365 0.0004267 0.0004115 0.0012601 0.3802968 0.2472307 0.0397153 -0.0004889 0.0190054 0.2301481 0.0009515 -0.0016278 -0.0003339 0.3790671 unknown
polarizability: 392.0676494|-4.0481073|195.6659115|-0.0898195|0.0427166|66.9829558 unknown
InChI: InChI=1S/C13H8Br2N2O/c14-6-1-2-7-8-4-11(16)10(15)5-12(8)17-13(18)9(7)3-6/h1-5,17H,16H2
charge 0 multiplicity 1
26 atoms
Br -5.379275 0.491322 0.002505
Br 5.590846 -0.973245 -0.000753
O  1.82354 3.078446 0.002383
N  -0.283323 2.099536 0.000382
N  -3.858137 -2.289677 0.002225
C  -0.652933 -0.327888 -0.001047
C  0.808505 -0.509634 -0.001548
C  -1.168356 1.005643 0.000306
C  1.661635 0.64025 -0.001313
C  -1.574781 -1.403363 -0.001531
C  1.114339 2.024298 -0.001912
C  -2.56683 1.229078 0.00127
C  1.430892 -1.791669 -0.001623
C  -2.980924 -1.212047 0.000739
C  3.073736 0.508342 -0.000957
C  -3.446153 0.140481 0.001771
C  2.828302 -1.930497 -0.001436
C  3.641462 -0.770361 -0.001082
H  -1.206965 -2.434503 -0.004102
H  -0.665017 3.05018 0.001948
H  -2.961358 2.25013 0.001849
H  0.82383 -2.70161 -0.001561
H  3.674439 1.42268 -0.000869
H  3.284995 -2.924236 -0.001459
H  -3.508342 -3.242717 0.006006
H  -4.863326 -2.136139 -0.001192
