program: Gaussian 09
title: 000278033
version: EM64L-G09RevD.01
frameworkgroup: C1[X(C13H8Br2N2O)]
method: RPBEPBE
basis: SDD
operation: Freq
keyword: #p
keyword: freq=noraman
keyword: PBEPBE/SDD
title: #p freq=noraman PBEPBE/SDD
converged: YES YES NO NO
title: Mulliken charges:
elementType: Br Br O N N C C C C C C C C C C C C C H H H H H H H H
charge: 0.025745 0.026831 -0.256371 -0.444075 -0.689737 0.453459 0.321376 0.115582 0.094517 0.418958 -0.019266 -0.462976 -0.337786 -0.347837 -0.444168 -0.193741 -0.247215 -0.243129 0.345139 0.226880 0.279236 0.271806 0.233513 0.238233 0.312584 0.322443
chargesum: 0.00000
title: Mulliken charges with hydrogens summed into heavy atoms:
elementType: Br Br O N N C C C C C C C C C C C C C
charge: 0.025745 0.026831 -0.256371 -0.098937 -0.054711 0.453459 0.321376 0.115582 0.094517 0.418958 -0.019266 -0.462976 -0.110906 -0.068601 -0.444168 0.078065 -0.013702 -0.004896
polarizability: 3.16567539e+02 -1.72528462e+00 2.30152673e+02 -3.12722146e+00 6.74515889e+00 7.30703651e+01
1716.lowfreq: -3.4018 -0.0005 0.0003 0.0006 0.7453 3.6446 29.1598 57.0586 89.7988
frequency: 29.1573 57.0529 89.7976 123.0229 124.3252 153.3567 164.0664 203.5176 213.1229 235.8853 257.7638 300.3803 324.9094 339.5467 348.4335 380.8915 423.5790 459.3049 484.6322 495.1597 532.4871 550.2376 582.6577 616.8114 626.5954 640.6907 658.6120 661.7160 722.8213 743.4691 758.8065 777.8037 789.2408 803.8424 849.3226 891.0756 899.5312 927.7394 982.2571 1008.8449 1039.5533 1056.8709 1081.8907 1118.6137 1153.0534 1183.8632 1202.8905 1255.9315 1275.5769 1283.7989 1315.8556 1368.1215 1381.4128 1401.9585 1407.6220 1440.4379 1460.7647 1484.2096 1562.5829 1566.0385 1582.9447 1614.5466 1626.8055 1648.2980 3136.8690 3152.3186 3169.3369 3187.6017 3210.6171 3487.1040 3499.8911 3626.6088
redmass: 8.6539 7.1259 5.5088 9.8750 9.3658 9.3220 6.5036 8.3818 4.5249 10.1313 3.4556 7.8689 4.1035 1.5931 6.7359 5.0256 3.4161 6.9917 8.0435 4.5286 5.0549 4.1858 1.2705 5.5031 6.5150 6.7075 5.6804 3.1072 5.6882 4.0567 2.8083 2.0817 1.9446 2.7940 1.3883 3.9925 1.6661 7.1200 1.3833 1.3457 2.7017 2.2521 2.5182 2.6467 1.6267 1.1346 2.8930 1.5832 2.6992 2.6002 2.9143 6.2692 8.0786 2.8352 3.6376 2.8783 3.3824 3.1477 6.4582 7.5273 6.3094 5.9629 4.4908 1.2732 1.0868 1.0914 1.0992 1.0929 1.0926 1.0757 1.0459 1.1007
irintensity: 0.9130 1.3755 3.3464 0.5217 0.2481 0.0893 0.6991 1.4981 3.5257 5.6777 9.2710 11.9308 5.3042 28.6198 0.5618 4.2257 3.6742 2.6648 2.2218 2.4955 3.9435 6.6621 279.3813 10.4424 7.9636 13.7773 3.2084 5.1540 39.7788 53.9043 49.5366 55.6723 32.0184 12.5715 16.1567 24.0387 4.5567 13.4804 2.2065 0.5121 57.3975 8.7353 26.9812 1.1652 34.4016 0.4405 7.4201 2.8978 1.6006 42.2467 80.1501 62.5666 39.9850 52.5039 38.5129 60.6862 56.2019 26.3399 14.1003 37.8861 12.5548 114.5979 320.8770 206.8022 5.3552 7.4879 22.7213 0.8659 7.5531 48.3282 46.4037 34.6868
temp: 298.150 k
press: 1.00000 atm
elementType: 35 35 8 7 7 6 6 6 6 6 6 6 6 6 6 6 6 6 1 1 1 1 1 1 1 1
symmnumber: 1
zpe: 473819.6 jmol-1
zpe.correction: 0.180468 hartree
zpe.thermalcorrener: 0.195722 hartree
zpe.thermalcorrenthalpy: 0.196667 hartree
zpe.thermalcorrgfe: 0.136270 hartree
zpe.sumelectzpe: -710.634195 hartree
zpe.sumelectthermal: -710.618941 hartree
zpe.sumelectthermalent: -710.617996 hartree
zpe.sumelectthermalfe: -710.678393 hartree
dipole: 1.5614 0.3783 1.6421
dipole: 2.2973
quadrupole: -111.3168 -123.6009 -126.7557
quadrupole: -18.4239 -2.9037 -4.2614
quadrupole: 9.2410 -3.0431 -6.1979 -18.4239 -2.9037 -4.2614
hfenergy: -710.814663 hartree
pointgroup: C01 [X(C13H8Br2N2O1)]
dipole: -0.6091424 -0.1696576 0.6458086 debye
dipolederiv: -0.1131285 0.1106343 0.0256835 0.101384 -0.5874784 -0.10748 -0.0094501 -0.1236412 -0.044943 -0.7984318 0.0629761 0.0457898 0.0724973 -0.0841998 -0.0091314 0.0600727 -0.008492 -0.0180245 -0.7773728 -0.3100961 0.0475133 -0.513716 -1.2209097 0.1414537 0.106401 0.1366063 -0.3862698 -1.19638 -0.6216133 0.1209692 -0.0653322 -0.5956268 -0.0209655 0.1365923 0.0103117 -0.2918459 -0.4212016 0.2221045 0.1673978 0.5077644 -1.2180841 0.045304 0.0730827 0.1927835 -0.468328 -0.0429961 0.1406761 0.0618521 -0.0512147 -0.2453236 -0.0126988 0.1003944 -0.0259792 0.0450425 0.425036 0.1023997 0.0182766 -0.1843509 0.1156878 -0.0286049 0.0670907 -0.026513 0.0119236 0.2149252 0.5948263 -0.0289553 0.2256447 0.4099401 -0.0463072 -0.1246589 -0.0451119 0.0679496 -0.0531707 0.1465024 -0.0270399 0.0705804 -0.4398054 0.0712424 -0.0440155 0.059083 -0.0017103 -0.1846086 -0.6461338 -0.0776047 -0.4695544 0.9193699 0.0820812 -0.1225073 0.1411241 0.094509 1.5053371 0.5040843 -0.1183954 0.2620572 1.3937682 -0.1990278 -0.1464299 -0.2252344 0.2232353 0.1717258 -0.368293 -0.0913821 0.0853099 0.9431679 0.2187303 -0.02552 0.2254708 -0.1257666 -0.3619578 0.0552388 -0.0427295 0.1191944 0.0021605 -0.0374437 -0.0733775 -0.0023441 -0.1241383 -0.1354927 -0.0709634 0.0169369 0.2037945 0.073242 -0.0136922 -0.0379359 -0.0216143 -0.1055497 1.3331817 -0.1311861 -0.1016795 -0.0413164 -0.0073523 0.025958 -0.0293829 -0.0614744 -0.1737279 -0.5333417 0.1853796 0.0611158 -0.0164158 -0.3197303 -0.0353208 0.0348625 -0.0550039 -0.0323991 0.1356339 -0.0648194 0.0228285 -0.0484236 0.139587 -0.0608818 0.0411499 -0.0528229 -0.1188182 0.100733 0.0251448 0.0016285 -0.1165853 -0.1584704 -0.0008439 0.0272426 0.0075908 -0.1597898 0.1874454 0.0219978 -0.004431 -0.0302408 0.1953227 0.0108812 -0.0091437 0.0361624 0.2937705 0.1351223 -0.0232559 0.0376752 -0.0052226 0.0082713 0.0364805 0.0223325 0.0252457 0.1474697 0.0988743 -0.0166174 -0.0000531 -0.0928399 0.0270657 0.0114127 0.0134224 0.0103633 0.1535556 0.0642432 -0.0431466 -0.0037969 -0.0455926 0.0434773 -0.0157834 -0.0178126 -0.0187476 0.1578631 0.0221671 0.072865 -0.0210319 0.1152923 -0.053243 0.0415806 -0.0250697 0.035676 0.1453755 -0.1301123 0.0027377 -0.0121346 -0.0042411 0.092437 0.0098153 -0.0151499 0.009721 0.1585884 0.1607898 0.0552196 -0.07451 -0.0409963 0.2999812 -0.042984 -0.0292993 -0.1689644 0.2364822 0.1929798 -0.0066618 -0.0239232 -0.0374766 0.2667452 -0.0637748 0.0271094 -0.0541955 0.3155463 unknown
polarizability: 316.2882632|-5.4221022|230.6118585|-1.6639733|4.6688005|72.8904556 unknown
InChI: InChI=1S/C13H8Br2N2O/c14-8-5-9(15)11(16)12-10(8)6-3-1-2-4-7(6)13(18)17-12/h1-5,17H,16H2
charge 0 multiplicity 1
26 atoms
Br -0.654575 -3.537718 -0.599203
Br -5.077859 -0.046335 0.108387
O  1.843107 3.066706 -0.463302
N  -0.129683 1.893585 -0.143851
N  -2.818961 2.222994 0.240516
C  -0.272961 -0.565834 -0.099168
C  1.210804 -0.588045 -0.022265
C  -0.900396 0.726502 -0.047226
C  1.943341 0.645488 -0.129504
C  -2.315256 0.920153 0.086961
C  1.263786 1.953727 -0.270499
C  -1.179813 -1.669308 -0.228233
C  1.981702 -1.765352 0.215598
C  3.35969 0.671745 -0.079124
C  -3.128822 -0.226481 -0.008064
C  -2.577178 -1.506782 -0.203003
C  3.386393 -1.727706 0.280952
C  4.090892 -0.510043 0.113701
H  -0.626079 2.77613 -0.310561
H  1.485406 -2.721855 0.370678
H  3.848326 1.645842 -0.184273
H  -3.232987 -2.371381 -0.319734
H  3.93535 -2.657066 0.46868
H  5.184771 -0.489422 0.153955
H  -2.361338 2.85092 0.903251
H  -3.828862 2.343037 0.15493
