program: Gaussian 09
title: 000278026
version: EM64L-G09RevD.01
frameworkgroup: C1[X(C15H15NO3)]
method: RPBEPBE
basis: SDD
operation: Freq
keyword: #p
keyword: freq=noraman
keyword: PBEPBE/SDD
title: #p freq=noraman PBEPBE/SDD
converged: YES YES NO NO
title: Mulliken charges:
elementType: O O O N C C C C C C C C C C C C C C C H H H H H H H H H H H H H H H
charge: -0.259124 -0.414957 -0.438936 -0.143641 0.151273 0.381761 0.162702 -0.495009 -0.290581 -0.373164 0.481512 -0.244396 -0.380816 -0.488534 -0.403145 0.300661 -0.183011 -0.400467 -0.684569 0.273916 0.229298 0.243875 0.209734 0.209862 0.203933 0.248716 0.250192 0.228187 0.223427 0.207267 0.233692 0.233673 0.370056 0.356612
chargesum: 0.00000
title: Mulliken charges with hydrogens summed into heavy atoms:
elementType: O O O N C C C C C C C C C C C C C C C
charge: -0.259124 -0.044901 -0.082324 -0.143641 0.151273 0.381761 0.162702 -0.221093 -0.061283 -0.129289 0.481512 0.175201 -0.176883 -0.239818 -0.152953 0.300661 0.045176 -0.177040 -0.009938
polarizability: 4.50350059e+02 -2.04500719e+00 1.81529366e+02 -1.54462432e-01 2.24929410e-01 7.96377031e+01
1716.lowfreq: -6.3785 -4.5144 -0.0006 -0.0003 0.0011 2.6164 22.1662 30.5756 44.5145
frequency: 21.2355 30.5547 44.5143 63.9613 98.3444 112.0212 125.9532 181.4930 192.6805 212.8434 220.6908 229.0751 242.8670 267.0736 325.6639 336.4454 355.2320 369.3981 386.9840 436.5279 455.6613 463.6638 477.4546 514.9032 562.5836 587.7118 599.0759 625.1930 633.4600 687.6963 723.1926 730.7630 750.0819 771.9450 782.8143 788.9952 827.6656 830.0659 861.5036 866.0730 878.3864 880.3537 918.0665 932.1468 957.2931 959.2244 976.3861 982.0036 1031.4660 1083.2012 1109.9514 1116.0503 1134.3064 1139.1239 1149.3982 1165.4783 1181.5727 1206.2577 1233.2072 1261.1409 1263.3272 1277.0926 1286.9332 1311.1521 1358.8126 1363.8039 1386.7158 1400.5349 1404.8473 1459.4196 1459.7647 1467.1818 1473.1748 1480.6735 1484.8732 1494.3144 1562.9093 1579.5123 1600.8077 1624.9818 1635.5138 2959.1799 2979.7995 2998.0245 3018.7705 3095.2713 3107.1042 3119.1882 3129.8733 3146.6746 3148.8784 3170.5255 3174.5560 3189.8308 3208.8170 3586.2933
redmass: 4.8105 4.1893 5.3255 4.5983 2.1782 3.0026 4.1383 4.6921 6.6931 3.7013 2.6673 5.0408 1.7019 2.8319 5.2541 3.7422 1.1179 4.8446 5.1895 2.8516 4.1139 3.2421 6.8029 7.3020 6.8343 4.2426 4.7113 3.5470 6.0729 1.8928 6.0593 2.8131 6.5610 1.2793 1.3680 1.5112 1.1059 4.7964 1.6007 4.3157 1.5340 1.3910 1.3595 3.2602 2.6963 1.6507 1.3599 6.1438 2.5296 1.6049 2.5214 2.1463 1.4344 1.3936 1.7970 1.1823 1.3850 1.6305 2.1137 1.1444 4.1215 2.2861 1.4831 1.5596 1.8061 1.5142 3.7274 1.3489 4.2077 2.8359 1.0398 3.0728 1.4926 1.6514 1.8159 1.5216 5.3117 7.0230 5.9115 6.4845 6.5508 1.0553 1.0860 1.0363 1.1077 1.0989 1.1014 1.0887 1.0889 1.0919 1.0917 1.0938 1.0963 1.0927 1.0619 1.0660
irintensity: 1.4517 1.0771 1.1339 0.0194 3.1072 0.0140 0.2642 4.6626 6.5106 0.7727 0.0012 0.0772 2.8610 9.6913 7.3534 0.1173 145.5060 1.8732 0.5305 1.3345 17.4378 13.1009 25.9619 0.5668 44.7464 0.7992 3.2842 3.2835 0.1163 33.6232 1.4574 0.2731 20.6598 28.6830 57.2022 126.8735 0.1717 3.9499 37.3485 15.2521 12.3674 0.7270 1.1024 82.1000 48.9455 28.7563 5.7155 1.7320 79.7044 10.7399 130.8644 24.1072 4.6495 193.9630 269.8994 18.5447 6.1984 21.5428 13.7457 0.3036 326.4012 232.5268 13.6164 37.8480 30.0661 21.5622 81.0729 79.8375 8.6413 5.4764 12.0218 147.6258 62.1719 1.9444 35.4822 24.1579 22.0844 109.8617 70.1945 107.9305 289.5231 41.4624 48.5256 33.6972 34.7120 29.3737 34.2099 10.9208 5.2587 21.0143 5.1314 17.5150 11.4365 0.3977 139.9258 52.0544
temp: 298.150 k
press: 1.00000 atm
elementType: 8 8 8 7 6 6 6 6 6 6 6 6 6 6 6 6 6 6 6 1 1 1 1 1 1 1 1 1 1 1 1 1 1 1
symmnumber: 1
zpe: 696814.0 jmol-1
zpe.correction: 0.265402 hartree
zpe.thermalcorrener: 0.283037 hartree
zpe.thermalcorrenthalpy: 0.283981 hartree
zpe.thermalcorrgfe: 0.218336 hartree
zpe.sumelectzpe: -859.634792 hartree
zpe.sumelectthermal: -859.617158 hartree
zpe.sumelectthermalent: -859.616214 hartree
zpe.sumelectthermalfe: -859.681859 hartree
dipole: -1.2827 -3.0787 0.0549
dipole: 3.3357
quadrupole: -67.7743 -110.7907 -117.4500
quadrupole: -18.0904 0.0595 0.0729
quadrupole: 30.8974 -12.1190 -18.7784 -18.0904 0.0595 0.0729
hfenergy: -859.9001949 hartree
pointgroup: C01 [X(C15H15N1O3)]
dipole: -0.5172862 1.1613536 0.3255263 debye
polarizability: 450.086553|6.9459162|173.6999413|-6.8239417|27.2295829|87.7306338 unknown
InChI: InChI=1S/C15H15NO3/c1-2-19-13-6-7-14(15(18)9-13)16-10-11-4-3-5-12(17)8-11/h3-10,17-18H,2H2,1H3
charge 0 multiplicity 1
34 atoms
O  5.094239 0.030907 -0.11774
O  1.015143 -2.425763 -0.707593
O  -6.105441 1.896897 0.711571
N  -0.519083 -0.384001 -0.104808
C  0.863509 -0.103878 -0.056799
C  3.696088 0.049544 -0.079308
C  1.670735 -1.248829 -0.394278
C  3.071971 -1.177297 -0.406306
C  1.518828 1.110623 0.26656
C  2.923268 1.199924 0.258756
C  -2.899023 0.13715 0.097534
C  5.822154 1.275459 0.209168
C  -1.471101 0.478492 0.167401
C  -3.850749 1.138977 0.424845
C  -3.352738 -1.15887 -0.286706
C  -5.230541 0.850325 0.370726
C  -4.731117 -1.432335 -0.337394
C  -5.683289 -0.435767 -0.010507
C  7.30938 0.959045 0.079999
H  3.675913 -2.050098 -0.66304
H  0.934727 2.000877 0.526687
H  3.40471 2.148079 0.511181
H  5.517007 2.075566 -0.495726
H  5.564877 1.591656 1.240671
H  -1.248732 1.521651 0.467921
H  -3.533793 2.144388 0.723056
H  -2.615967 -1.926013 -0.539731
H  -5.080029 -2.427591 -0.633562
H  -6.756987 -0.65989 -0.053292
H  7.91085 1.856334 0.313535
H  7.59764 0.153018 0.776009
H  7.550109 0.633072 -0.946155
H  0.034766 -2.18715 -0.621317
H  -7.048522 1.605298 0.64874
