program: Gaussian 09
title: 000277994
version: EM64L-G09RevD.01
frameworkgroup: C1[X(C8H16Si2)]
method: RPBEPBE
basis: SDD
operation: Freq
keyword: #pfreq=noraman
keyword: PBEPBE/SDD
title: #p freq=noraman PBEPBE/SDD
converged: YES YES NO NO
title: Mulliken charges:
elementType: Si Si C C C C C C C C H H H H H H H H H H H H H H H H
charge: 1.301423 1.301354 -1.189856 -1.223595 -1.013478 -1.013073 -0.463902 -0.464460 -0.509081 -0.508803 0.267163 0.265954 0.253231 0.275823 0.233588 0.246174 0.239787 0.233566 0.239807 0.246173 0.207280 0.207469 0.216509 0.217160 0.216584 0.217204
chargesum: 0.00000
title: Mulliken charges with hydrogens summed into heavy atoms:
elementType: Si Si C C C C C C C C
charge: 1.301423 1.301354 -0.656739 -0.694541 -0.293928 -0.293527 -0.256623 -0.256991 -0.075412 -0.075016
polarizability: 1.48786216e+02 -6.31434384e-02 1.48401023e+02 3.87471803e-02 -1.05830525e+01 1.04869824e+02
1716.lowfreq: -2.8598 -0.0020 -0.0012 -0.0007 7.6145 13.7546 23.5532 50.0007 64.8446
frequency: 23.1574 49.9755 64.8441 105.1572 131.3968 134.8916 140.1700 141.4921 157.3913 176.5063 203.9449 212.7498 242.3968 330.1228 359.7610 380.2398 529.0597 533.8515 542.2854 605.0909 610.0257 621.0749 646.7075 669.9747 682.2328 695.6306 723.7363 784.1188 805.6370 834.7926 874.6566 882.9372 928.2369 971.3432 974.2947 987.8283 1000.1865 1009.4139 1009.4680 1011.6861 1016.7936 1027.9112 1262.7883 1264.0415 1292.8718 1295.8054 1382.0615 1391.0433 1410.9268 1412.0591 1444.4526 1447.0331 1449.0538 1450.8787 1605.4558 1606.3493 2980.7382 2980.8396 3017.1945 3021.8077 3055.7826 3055.9988 3074.4624 3074.8657 3083.8459 3084.4207 3088.6475 3089.1190 3090.0337 3094.4663 3167.2091 3167.7060
redmass: 3.5192 2.5868 2.2660 2.8889 2.8999 2.1598 1.1872 1.0527 2.1830 2.5273 2.6691 2.0377 1.8176 3.8578 3.5165 3.4858 1.5351 1.5666 3.5914 1.5266 5.3020 3.0114 3.1932 3.5200 3.3499 3.8966 3.0978 3.1137 1.2377 1.3609 1.5314 1.6064 1.0615 1.3380 1.3421 1.1554 1.2030 1.1100 1.2263 1.1120 1.2506 1.2671 1.3062 1.3016 1.1958 1.1941 1.0954 1.0811 1.2515 1.2441 1.0518 1.0521 1.0522 1.0513 3.8232 3.8150 1.0337 1.0337 1.0594 1.0584 1.0714 1.0712 1.0773 1.0773 1.0983 1.0981 1.0988 1.0987 1.1005 1.1025 1.1144 1.1144
irintensity: 0.0105 0.0023 0.0384 0.0844 0.0761 0.0326 0.0061 0.0226 0.0502 0.9293 0.0188 0.1981 3.0741 1.0531 0.5626 4.0610 18.5328 27.3498 2.1263 0.1730 1.8561 1.9821 7.1647 41.3287 40.9251 47.7904 5.0478 115.6136 1.0426 143.5182 96.7806 95.3178 0.0087 53.0369 72.5022 0.6772 10.3255 27.8977 11.0756 25.8392 20.9763 101.1184 3.6830 1.9182 10.8632 47.1258 28.3070 1.5120 0.6721 38.5757 0.7040 8.5304 8.6563 4.0321 1.0979 0.0483 8.9223 23.8884 14.7143 8.0217 13.7682 19.6936 17.3206 23.1085 19.4082 15.6071 10.8646 16.4992 7.8080 9.2284 42.0456 24.6335
temp: 298.150 k
press: 1.00000 atm
elementType: 14 14 6 6 6 6 6 6 6 6 1 1 1 1 1 1 1 1 1 1 1 1 1 1 1 1
symmnumber: 1
zpe: 554320.4 jmol-1
zpe.correction: 0.211129 hartree
zpe.thermalcorrener: 0.226262 hartree
zpe.thermalcorrenthalpy: 0.227206 hartree
zpe.thermalcorrgfe: 0.168532 hartree
zpe.sumelectzpe: -892.410059 hartree
zpe.sumelectthermal: -892.394927 hartree
zpe.sumelectthermalent: -892.393983 hartree
zpe.sumelectthermalfe: -892.452657 hartree
dipole: -0.0002 -0.1697 0.0311
dipole: 0.1725
quadrupole: -76.4778 -75.1840 -78.0937
quadrupole: -0.0207 0.0090 -1.4657
quadrupole: 0.1074 1.4012 -1.5086 -0.0207 0.0090 -1.4657
hfenergy: -892.6211888 hartree
pointgroup: C01 [X(C8H16Si2)]
dipole: 0.0009672 0.0664819 0.0135809 debye
dipolederiv: 1.3641037 0.1045735 0.0821063 -0.0229111 1.1902084 0.0117567 0.01722 -0.138726 0.9233184 1.3636473 -0.1082638 -0.081766 0.017326 1.1914391 0.0150743 -0.0201859 -0.1381043 0.9218566 -0.7397999 0.0032323 -0.0005462 0.0036059 -0.4754883 -0.0238105 0.0010792 0.0710422 -0.5029496 -0.7668636 0.004111 -0.0013049 0.0047192 -0.4467546 -0.0580697 -0.0002991 0.0004136 -0.4821678 -0.4003042 0.026601 -0.0311497 0.0928757 -0.4185186 0.0270729 -0.0256 0.054797 -0.2138989 -0.4040927 -0.0265725 0.0316951 -0.0934325 -0.4148811 0.0255592 0.0260969 0.05475 -0.2134766 -0.329852 0.0759977 -0.1597207 0.1107855 -0.3583843 0.0380263 -0.1905497 0.0393629 -0.2587987 -0.3396557 -0.0778572 0.1608032 -0.1128829 -0.3529491 0.0324858 0.1911182 0.032146 -0.2548376 -0.1180003 0.0342637 -0.2188831 0.0638588 -0.098728 0.0626195 -0.1771157 0.112967 -0.0863719 -0.1252842 -0.0370788 0.2196971 -0.0655244 -0.0976829 0.0558887 0.1786598 0.107857 -0.0803267 0.0519884 -0.0015474 -0.0015631 -0.0013635 -0.0661738 -0.121747 -0.0015678 -0.1170144 0.0096903 0.1049829 -0.0016244 0.0016234 -0.0016001 -0.0002981 0.1119498 0.001811 0.1139975 -0.0244036 0.1236689 -0.0030267 -0.0008905 -0.0030657 -0.1150503 -0.080581 -0.0008671 -0.0701573 0.0641834 0.0850005 -0.0006282 0.0017573 -0.0005707 0.0515758 0.0921502 0.0015214 0.0903618 -0.0846822 0.0343594 -0.1121463 0.0232992 -0.1448017 -0.0768618 0.0209079 0.0303955 0.0308149 0.0890441 0.0082597 0.0169505 -0.1108911 0.0360459 0.101714 0.0169405 -0.126178 0.0154076 -0.0515088 -0.0052156 0.0629271 0.0990698 0.0843437 0.0719565 -0.0552718 0.1058607 -0.0654812 -0.0149259 0.0413281 0.1084734 -0.0237962 0.1415895 -0.0834714 0.0227539 -0.0305002 0.0329135 0.0885207 -0.0070093 -0.0605743 -0.1000366 -0.0821313 0.0751925 -0.0535304 -0.1070065 -0.0636008 -0.0163106 0.0048869 -0.0142653 0.1118279 -0.0333913 0.1030077 0.0135047 0.1272078 0.0115145 -0.0495941 -0.0430417 -0.0374304 0.1441403 -0.0621721 0.0607201 -0.0310833 0.1688894 -0.0271241 -0.0034533 -0.0364788 0.0417861 -0.1446196 0.0666505 0.058669 -0.026223 -0.1691946 -0.0216845 -0.0073137 0.023858 -0.1599015 0.0762227 -0.185022 -0.0388698 -0.0157448 0.093906 -0.0123619 0.1282932 0.0367125 0.0330418 0.1354198 0.0251135 0.0925584 -0.0357754 0.1091971 -0.0540533 -0.0014408 0.0346973 0.1587038 -0.0763504 0.1843062 -0.0476373 -0.0135401 -0.0935357 -0.0096076 0.1264515 0.0381046 -0.0297453 -0.1361438 -0.0223512 0.0947079 -0.0313132 -0.1103627 -0.0504301 -0.0048976 unknown
polarizability: 148.7840506|-0.0854164|147.9515466|0.1621763|11.4643444|105.3214648 unknown
InChI: InChI=1S/C8H16Si2/c1-5-9(3)7-10(4,6-2)8-9/h5-6H,1-2,7-8H2,3-4H3
charge 0 multiplicity 1
26 atoms
Si -1.364097 0.48401 0.056836
Si 1.377098 0.446521 0.062082
C  0.006849 0.668399 1.43005
C  0.002792 0.008493 -1.240187
C  -2.229904 2.148291 -0.320922
C  2.288905 2.086733 -0.312982
C  -2.653882 -0.868917 0.396703
C  2.627466 -0.942031 0.405865
C  -2.762515 -2.041222 -0.285609
C  2.713083 -2.110635 -0.285997
H  0.018875 1.62483 1.981345
H  -0.005841 -0.157083 2.164565
H  -0.011454 -1.065346 -1.505822
H  0.012585 0.588747 -2.178755
H  -1.484435 2.950143 -0.474397
H  -2.849488 2.073116 -1.232902
H  -2.887541 2.450526 0.515078
H  1.565541 2.906872 -0.475587
H  2.946693 2.374739 0.52789
H  2.914269 1.992552 -1.219232
H  -3.368511 -0.685839 1.217437
H  3.336906 -0.784857 1.236354
H  -3.527901 -2.791496 -0.043873
H  -2.088892 -2.292898 -1.115779
H  3.455654 -2.88307 -0.042941
H  2.042444 -2.336579 -1.125925
