program: Gaussian 09
title: 000278023
version: EM64L-G09RevD.01
frameworkgroup: C1[X(C15H13Cl2NO2)]
method: RPBEPBE
basis: SDD
operation: Freq
keyword: #p
keyword: freq=noraman
keyword: PBEPBE/SDD
title: #p freq=noraman PBEPBE/SDD
converged: YES YES NO NO
title: Mulliken charges:
elementType: Cl Cl O O N C C C C C C C C C C C C C C C H H H H H H H H H H H H H
charge: -0.012476 0.000763 -0.256299 -0.411246 -0.143208 0.149642 0.382715 0.165312 -0.492524 -0.287649 -0.370542 0.494461 -0.245997 -0.386095 -0.348060 -0.383409 -0.081341 -0.192917 -0.100943 -0.683345 0.276522 0.229321 0.246076 0.211403 0.211327 0.208535 0.254834 0.258035 0.260674 0.208728 0.234430 0.234400 0.368871
chargesum: 0.00000
title: Mulliken charges with hydrogens summed into heavy atoms:
elementType: Cl Cl O O N C C C C C C C C C C C C C C C
charge: -0.012476 0.000763 -0.256299 -0.042374 -0.143208 0.149642 0.382715 0.165312 -0.216001 -0.058328 -0.124467 0.494461 0.176732 -0.177560 -0.093226 -0.125373 -0.081341 0.067757 -0.100943 -0.005787
polarizability: 5.21333700e+02 -4.06787023e+00 1.94374850e+02 -3.18114271e-02 5.88923420e-03 8.25995648e+01
1716.lowfreq: -4.3815 -3.0921 -0.0019 0.0010 0.0015 2.5288 18.2697 23.8420 37.0729
frequency: 17.3847 23.8168 37.0686 53.6206 91.8656 105.1214 115.4791 127.2308 158.0376 169.7659 191.9627 202.4680 218.1340 239.4390 244.3255 305.8648 316.5360 326.5928 337.6355 390.5651 393.7823 433.7358 437.6396 455.6380 472.1469 520.5006 571.3019 571.9898 601.2904 625.0815 651.8877 695.5890 703.5551 726.1258 730.7860 759.2891 782.9280 815.7516 827.4512 831.0204 863.1175 865.2094 873.9830 879.0606 919.9340 952.7839 957.1597 972.6780 999.7198 1030.3919 1111.1414 1115.9757 1117.9414 1133.9472 1137.1986 1150.7065 1190.2437 1215.0273 1242.0024 1261.4215 1261.5779 1276.0944 1290.5343 1339.0481 1361.4753 1383.2181 1386.0903 1395.0437 1401.2516 1458.5829 1459.9505 1470.5570 1477.0514 1482.7651 1493.8240 1550.3182 1563.8079 1584.2387 1602.8276 1636.1027 2961.0344 2984.2342 2998.8813 3021.3207 3096.1465 3108.5698 3131.1913 3147.4985 3160.0857 3171.3543 3179.8836 3190.7875 3235.9157
redmass: 6.1434 5.5590 6.6842 5.0462 4.4576 1.9534 4.9785 4.5296 10.3156 5.1184 17.4366 6.9785 2.2266 3.3198 1.9834 7.1217 3.7825 4.0586 5.9652 6.6179 5.2659 7.7999 3.0492 3.2156 6.4278 6.3269 6.5443 4.8680 5.0324 3.6402 6.7603 6.6834 3.2868 6.3512 2.7066 1.1829 1.4978 5.4412 1.1085 1.3555 1.5977 4.2897 1.4692 4.7291 1.3585 1.6124 2.7055 1.4028 5.0197 2.5199 2.5969 2.1456 2.3895 1.4333 1.2990 1.7741 1.8356 1.8719 1.5526 2.2188 1.4211 1.9124 1.5773 2.4767 1.4870 3.2816 5.8007 2.0748 1.4068 2.9571 1.0395 1.7344 2.0894 1.3755 1.4971 7.2433 5.8688 6.2914 6.8334 6.5983 1.0553 1.0861 1.0363 1.1078 1.0989 1.1015 1.0889 1.0921 1.0882 1.0939 1.0969 1.0929 1.0619
irintensity: 2.0527 0.0434 0.8420 1.0481 0.8888 1.1760 0.3957 0.0354 0.0898 2.9121 0.5206 0.0143 0.2947 6.7264 0.0940 14.0448 0.1301 0.3215 11.1357 4.4527 2.1248 17.1144 2.1864 11.4002 27.6514 25.2838 17.5095 9.1763 6.1226 6.4489 20.0710 16.7843 2.9854 6.3884 0.3595 79.9395 72.6086 1.3600 1.8402 36.8604 37.2153 18.2266 10.7237 28.2210 0.7709 28.7194 46.7449 4.7687 25.4436 85.6863 150.9943 43.2058 54.8303 4.7420 16.7082 237.9276 3.9169 19.3455 2.3166 315.9103 127.0766 116.0596 63.8798 64.4719 2.3074 111.7777 10.1460 15.0021 57.7679 142.7172 12.2904 96.6560 33.3932 48.7220 29.2915 2.5847 100.5347 25.5291 35.4875 397.4244 40.7661 48.1035 33.3681 33.3366 28.2810 33.1842 4.7685 1.7337 1.4916 17.4680 3.4948 1.0309 121.2423
temp: 298.150 k
press: 1.00000 atm
elementType: 17 17 8 8 7 6 6 6 6 6 6 6 6 6 6 6 6 6 6 6 1 1 1 1 1 1 1 1 1 1 1 1 1
symmnumber: 1
zpe: 637198.7 jmol-1
zpe.correction: 0.242696 hartree
zpe.thermalcorrener: 0.261685 hartree
zpe.thermalcorrenthalpy: 0.262629 hartree
zpe.thermalcorrgfe: 0.192649 hartree
zpe.sumelectzpe: -1703.268641 hartree
zpe.sumelectthermal: -1703.249653 hartree
zpe.sumelectthermalent: -1703.248709 hartree
zpe.sumelectthermalfe: -1703.318689 hartree
dipole: 3.5877 -3.2441 0.0313
dipole: 4.8370
quadrupole: -125.9069 -124.8201 -135.0592
quadrupole: -21.8982 0.1160 0.0292
quadrupole: 2.6885 3.7753 -6.4638 -21.8982 0.1160 0.0292
hfenergy: -1703.5113376 hartree
pointgroup: C01 [X(C15H13Cl2N1O2)]
dipole: 1.4095237 1.2012364 0.4379619 debye
polarizability: 520.8062802|9.7736352|177.8138947|-12.3130851|39.606023|99.6879398 unknown
InChI: InChI=1S/C15H13Cl2NO2/c1-2-20-11-4-6-14(15(19)8-11)18-9-10-3-5-12(16)13(17)7-10/h3-9,19H,2H2,1H3
charge 0 multiplicity 1
33 atoms
Cl -6.051863 2.018385 1.125931
Cl -7.067867 -0.877444 -0.072648
O  5.44795 0.05602 -0.137669
O  1.372735 -2.327751 -0.970489
N  -0.160695 -0.369682 -0.106216
C  1.220274 -0.098147 -0.044343
C  4.052402 0.065346 -0.082317
C  2.025671 -1.192352 -0.525945
C  3.426159 -1.115156 -0.546032
C  1.878441 1.072361 0.413399
C  3.281058 1.165905 0.399678
C  -2.534147 0.110666 0.183473
C  6.179428 1.25573 0.326661
C  -1.109958 0.453633 0.27641
C  -3.497814 1.059641 0.62312
C  -2.988982 -1.137341 -0.331506
C  -4.872148 0.769823 0.550395
C  -4.36214 -1.423037 -0.403009
C  -5.310662 -0.470207 0.037861
C  7.66524 0.958118 0.148712
H  4.027898 -1.949274 -0.912795
H  1.296677 1.923674 0.784833
H  3.764873 2.078434 0.757011
H  5.867501 2.131519 -0.277911
H  5.930203 1.44804 1.390024
H  -0.888155 1.45607 0.692032
H  -3.17675 2.027446 1.02332
H  -2.253727 -1.871253 -0.671874
H  -4.71573 -2.379702 -0.798454
H  8.267158 1.823043 0.481774
H  7.959978 0.076576 0.742836
H  7.898054 0.756398 -0.91055
H  0.392338 -2.113778 -0.847409
