program: Gaussian 09
title: 000278024
version: EM64L-G09RevD.01
frameworkgroup: C1[X(C15H13Cl2NO2)]
method: RPBEPBE
basis: SDD
operation: Freq
keyword: #p
keyword: freq=noraman
keyword: PBEPBE/SDD
title: #p freq=noraman PBEPBE/SDD
converged: YES YES NO NO
title: Mulliken charges:
elementType: Cl Cl O O N C C C C C C C C C C C C C C C H H H H H H H H H H H H H
charge: -0.046601 -0.047509 -0.255476 -0.408857 -0.138280 0.148296 0.382637 0.166899 -0.491610 -0.286821 -0.370285 0.489594 -0.246361 -0.379710 -0.352252 -0.354534 -0.068959 -0.078685 -0.231576 -0.682848 0.277517 0.229779 0.246566 0.211968 0.211545 0.207955 0.256085 0.277182 0.285238 0.208987 0.234623 0.234734 0.370759
chargesum: 0.00000
title: Mulliken charges with hydrogens summed into heavy atoms:
elementType: Cl Cl O O N C C C C C C C C C C C C C C C
charge: -0.046601 -0.047509 -0.255476 -0.038098 -0.138280 0.148296 0.382637 0.166899 -0.214093 -0.057042 -0.123720 0.489594 0.177152 -0.171754 -0.096166 -0.077352 -0.068959 -0.078685 0.053661 -0.004503
polarizability: 4.84368495e+02 -5.00286285e+00 2.16508551e+02 2.69182240e-01 4.10446255e-01 8.24427059e+01
1716.lowfreq: -2.4699 -1.1003 -0.0028 -0.0024 -0.0021 5.9581 17.0822 27.5055 37.6204
frequency: 16.8579 27.4883 37.6195 60.6613 99.4841 105.7199 110.7135 148.5284 156.9746 164.3252 194.0994 210.8559 219.6567 227.9877 245.1907 267.6724 313.8779 330.4885 351.8029 375.2191 388.7311 407.8305 448.9447 467.4191 478.5424 514.2353 557.3172 561.9751 599.3298 625.3429 646.3187 674.6154 725.3984 730.2206 751.3419 751.7378 783.3949 813.4160 829.0663 857.3867 863.7539 865.4912 872.1646 898.7654 920.1767 921.2296 953.1651 957.5804 978.7604 1030.3055 1088.4299 1102.6552 1114.4370 1116.9273 1134.4238 1151.4991 1192.8781 1215.4089 1248.2575 1256.7005 1263.9850 1266.0085 1293.1081 1353.1970 1365.0821 1385.6139 1391.9268 1402.0934 1414.7272 1436.2225 1460.2083 1470.2004 1475.3804 1482.8185 1494.4374 1548.4310 1562.1904 1584.0154 1603.1731 1635.6656 2962.0834 2989.2352 2999.1701 3022.7507 3096.3943 3108.9142 3134.4606 3157.3025 3173.9922 3185.9243 3188.8984 3190.9850 3259.8219
redmass: 6.3965 4.9664 7.6773 4.9068 3.1562 5.9812 2.3142 10.4480 5.9798 5.1229 4.4204 9.1544 2.2824 6.4793 1.6878 2.8327 5.6825 4.3988 5.3410 10.7721 5.2832 8.6995 2.9557 4.6336 7.0023 5.2458 4.5783 6.9050 4.7084 3.6991 6.0672 2.2270 6.2276 2.5797 1.2926 6.4886 1.5252 5.4247 1.1072 1.4907 1.5990 4.2743 1.4343 1.4035 5.0347 1.3935 1.6990 2.7054 5.6528 2.5268 1.5484 1.7902 2.5534 2.1156 1.4352 1.7597 1.9080 2.0242 1.2545 2.0904 1.1423 3.6820 1.5143 2.2098 1.5039 4.0817 3.6789 1.3369 2.5212 3.5360 1.0395 2.2338 1.7902 1.3161 1.4757 6.3626 5.9033 6.6480 7.0669 6.5784 1.0554 1.0862 1.0363 1.1078 1.0988 1.1015 1.0885 1.0924 1.0939 1.0920 1.0938 1.0929 1.0620
irintensity: 1.6611 0.0474 0.4126 0.9771 1.3632 0.0592 0.7895 0.1471 0.0554 2.8025 0.9223 0.5053 0.0605 0.8585 1.9415 2.9280 10.2712 1.1550 9.5917 5.8576 0.3146 5.0302 8.6966 5.5495 22.5494 0.0008 0.0530 54.3121 6.4524 2.5507 4.8531 23.8006 3.9040 2.3845 97.0254 100.3270 66.6597 4.0463 0.3704 29.9758 38.3826 23.8475 6.4421 5.9737 56.9074 2.7859 37.3160 44.7689 9.2516 89.8422 16.9105 17.7857 78.4164 65.1872 4.8268 258.7980 2.1775 16.3081 29.8505 29.3731 0.6847 520.6941 76.6393 89.0993 5.6765 78.0650 3.7492 68.5407 42.3712 40.0804 12.3569 153.6852 35.4468 32.1812 21.3894 73.3911 185.3153 188.7922 11.9718 361.7144 40.6248 48.6021 32.4357 32.8530 28.1172 32.9889 4.5295 0.9034 16.9071 2.1593 4.1909 1.0612 104.4221
temp: 298.150 k
press: 1.00000 atm
elementType: 17 17 8 8 7 6 6 6 6 6 6 6 6 6 6 6 6 6 6 6 1 1 1 1 1 1 1 1 1 1 1 1 1
symmnumber: 1
zpe: 637126.4 jmol-1
zpe.correction: 0.242669 hartree
zpe.thermalcorrener: 0.261672 hartree
zpe.thermalcorrenthalpy: 0.262616 hartree
zpe.thermalcorrgfe: 0.192763 hartree
zpe.sumelectzpe: -1703.271780 hartree
zpe.sumelectthermal: -1703.252777 hartree
zpe.sumelectthermalent: -1703.251833 hartree
zpe.sumelectthermalfe: -1703.321686 hartree
dipole: -3.3974 -4.3998 -0.0485
dipole: 5.5591
quadrupole: -114.2983 -131.6269 -135.0415
quadrupole: 16.0515 0.1526 0.0779
quadrupole: 12.6906 -4.6380 -8.0526 16.0515 0.1526 0.0779
hfenergy: -1703.5144491 hartree
pointgroup: C01 [X(C15H13Cl2N1O2)]
dipole: -1.2999315 1.4670201 -0.9702818 debye
polarizability: 484.4464013|-1.8573196|174.2082922|-1.6298714|-62.2322128|124.6650583 unknown
InChI: InChI=1S/C15H13Cl2NO2/c1-2-20-13-3-4-14(15(19)8-13)18-9-10-5-11(16)7-12(17)6-10/h3-9,19H,2H2,1H3
charge 0 multiplicity 1
33 atoms
Cl 5.111276 -2.396729 1.661939
Cl 6.09494 2.09822 -1.448096
O  -5.361239 -0.027831 0.093738
O  -1.215283 -2.034375 1.410354
N  0.259131 -0.208329 0.198968
C  -1.130347 -0.01433 0.077674
C  -3.967215 0.032537 0.054682
C  -1.899827 -1.030525 0.750899
C  -3.302624 -1.010315 0.740909
C  -1.827017 1.020049 -0.600063
C  -3.231585 1.054865 -0.618724
C  2.615371 0.310076 -0.170913
C  -6.134705 1.024554 -0.603039
C  1.177186 0.565586 -0.332211
C  3.541135 1.195622 -0.792014
C  3.102078 -0.79495 0.584948
C  4.485575 -0.984389 0.697836
C  4.918576 0.961171 -0.648229
C  5.427989 -0.123094 0.09232
C  -7.609341 0.68867 -0.401463
H  -3.876823 -1.785698 1.252172
H  -1.272953 1.810139 -1.119501
H  -3.744602 1.862379 -1.146785
H  -5.882466 2.013088 -0.168432
H  -5.864657 1.026385 -1.67858
H  0.921034 1.457301 -0.936618
H  3.183944 2.04995 -1.375869
H  2.393299 -1.474475 1.063166
H  6.502392 -0.291415 0.194514
H  -8.24133 1.444541 -0.90204
H  -7.844757 -0.301722 -0.826374
H  -7.863211 0.675344 0.671977
H  -0.240543 -1.815897 1.264059
