program: Gaussian 09
title: 000278021
version: EM64L-G09RevD.01
frameworkgroup: C1[X(C15H14ClNO2)]
method: RPBEPBE
basis: SDD
operation: Freq
keyword: #p
keyword: freq=noraman
keyword: PBEPBE/SDD
title: #p freq=noraman PBEPBE/SDD
converged: YES YES NO NO
title: Mulliken charges:
elementType: Cl O O N C C C C C C C C C C C C C C C H H H H H H H H H H H H H H
charge: -0.061914 -0.257323 -0.412478 -0.142123 0.382402 0.148990 0.164775 -0.493429 -0.371499 -0.288373 0.464929 -0.245364 -0.379696 -0.335365 -0.381824 -0.683779 -0.098146 -0.200807 -0.232779 0.275623 0.245351 0.229425 0.210890 0.210784 0.205185 0.251587 0.253671 0.208255 0.234157 0.234127 0.235762 0.259556 0.369427
chargesum: 0.00000
title: Mulliken charges with hydrogens summed into heavy atoms:
elementType: Cl O O N C C C C C C C C C C C C C C C
charge: -0.061914 -0.257323 -0.043050 -0.142123 0.382402 0.148990 0.164775 -0.217806 -0.126148 -0.058948 0.464929 0.176311 -0.174511 -0.083778 -0.128153 -0.007240 -0.098146 0.034955 0.026777
polarizability: 4.66532631e+02 -6.35976191e+00 1.90189900e+02 -6.15577207e-02 2.89551160e-03 7.99262312e+01
1716.lowfreq: -6.7088 -0.0003 0.0013 0.0015 0.9884 2.8168 18.9871 31.4000 41.7751
frequency: 18.2470 31.2828 41.7722 62.6987 97.9722 111.1710 122.2699 161.9784 180.4610 182.7942 218.9201 226.4364 244.2925 261.5914 288.5018 327.1608 345.1048 385.2427 386.4044 430.5005 449.3153 453.5576 476.5756 554.5616 561.2626 598.6402 625.1351 627.9449 681.0235 686.2317 725.4312 730.3338 764.1609 782.9971 796.3265 812.1080 828.6135 862.4336 865.0120 875.7727 876.7411 911.2247 920.0036 955.4752 957.2399 981.2084 988.8418 1030.9530 1067.0389 1093.2748 1112.7409 1116.8090 1134.1349 1150.6302 1169.4162 1190.2864 1217.4354 1250.6392 1261.2278 1265.5684 1285.9012 1302.0655 1351.5295 1361.1420 1385.7336 1393.5587 1401.0258 1417.4663 1460.6071 1462.2303 1471.5456 1478.1292 1483.4096 1494.7188 1557.3931 1567.6107 1588.1482 1611.0837 1635.8271 2960.6101 2981.3514 2998.5014 3020.7127 3095.8788 3107.8430 3131.3319 3143.8776 3146.1424 3167.9090 3171.3966 3178.2883 3190.6816 3225.9551
redmass: 5.5869 4.2076 6.3931 4.7205 2.5807 2.5488 4.5006 8.5493 4.9111 5.1997 2.5480 6.1705 1.5371 2.8046 5.4482 4.7836 4.2628 9.2619 5.1123 2.9180 5.0455 3.1539 6.7802 4.7687 6.8739 4.6957 3.6647 6.2354 7.0719 2.1096 6.2545 2.7582 1.1823 1.4566 1.4500 5.4627 1.1061 1.5999 4.2150 4.4125 1.4602 1.3684 1.3586 1.6786 2.6955 5.8979 1.3589 2.5430 2.0095 1.6080 2.6240 2.1251 1.4305 1.8080 1.1102 1.7425 1.8887 1.7712 1.1456 4.1098 1.4917 1.4652 2.0367 1.4636 4.0898 4.0296 1.3376 2.7062 1.0396 2.8580 1.6027 2.1142 1.3700 1.5127 5.7122 6.1675 6.2447 6.9376 6.5845 1.0553 1.0861 1.0363 1.1077 1.0989 1.1015 1.0889 1.0875 1.0923 1.0923 1.0939 1.0987 1.0929 1.0618
irintensity: 2.3953 0.2729 1.0066 0.5773 1.6210 0.4416 0.4909 1.6896 2.3379 0.0786 0.7322 1.2763 2.5895 3.4470 9.5617 7.0049 2.4517 1.1623 0.8089 0.1940 10.6432 13.4800 22.2951 0.4104 48.5295 5.8736 3.7995 1.0607 38.7344 28.0722 8.0612 0.0196 73.2313 63.6934 73.9540 6.5656 0.1980 37.4931 24.7088 36.2693 8.1905 0.1219 0.7524 30.4958 48.6558 7.7600 2.4080 84.5885 21.1591 7.7722 109.0543 41.1184 4.6852 252.9946 1.5288 3.8189 18.2484 6.1460 0.1293 523.4460 11.3863 44.4983 55.8932 4.6086 87.4096 0.3557 69.3961 25.9452 12.2045 106.7317 92.5113 15.4377 36.5509 25.1960 7.3252 128.8130 90.1968 7.2739 360.5379 40.4881 47.0230 32.8924 33.7337 28.5327 33.6381 4.9692 10.5808 1.3975 2.3484 16.8851 9.7903 0.8331 124.3307
temp: 298.150 k
press: 1.00000 atm
elementType: 17 8 8 7 6 6 6 6 6 6 6 6 6 6 6 6 6 6 6 1 1 1 1 1 1 1 1 1 1 1 1 1 1
symmnumber: 1
zpe: 662508.3 jmol-1
zpe.correction: 0.252336 hartree
zpe.thermalcorrener: 0.270015 hartree
zpe.thermalcorrenthalpy: 0.270959 hartree
zpe.thermalcorrgfe: 0.204493 hartree
zpe.sumelectzpe: -1243.883779 hartree
zpe.sumelectthermal: -1243.866100 hartree
zpe.sumelectthermalent: -1243.865156 hartree
zpe.sumelectthermalfe: -1243.931622 hartree
dipole: 1.7340 -2.7191 0.0358
dipole: 3.2252
quadrupole: -105.8819 -112.6698 -123.5800
quadrupole: -24.7762 0.0286 0.0275
quadrupole: 8.1619 1.3741 -9.5361 -24.7762 0.0286 0.0275
hfenergy: -1244.1361147 hartree
pointgroup: C01 [X(C15H14Cl1N1O2)]
dipole: 0.7226629 0.9844607 0.3444338 debye
polarizability: 465.7969759|2.306722|174.7837361|-18.0719254|37.9797209|96.0680499 unknown
InChI: InChI=1S/C15H14ClNO2/c1-2-19-13-6-7-14(15(18)9-13)17-10-11-4-3-5-12(16)8-11/h3-10,18H,2H2,1H3
charge 0 multiplicity 1
33 atoms
Cl -6.440245 1.94999 1.159686
O  5.088748 0.076892 -0.167314
O  1.022763 -2.347395 -0.931307
N  -0.517251 -0.390862 -0.084412
C  3.692997 0.077309 -0.101047
C  0.86262 -0.105951 -0.038297
C  1.672059 -1.201519 -0.509599
C  3.071933 -1.114729 -0.542075
C  2.917693 1.178976 0.370687
C  1.515438 1.075488 0.396855
C  -2.894795 0.077249 0.21745
C  5.814838 1.288158 0.273211
C  -1.470337 0.430962 0.290462
C  -3.85603 1.033313 0.654542
C  -3.345681 -1.182037 -0.272908
C  7.301409 0.998478 0.088013
C  -5.222109 0.713426 0.593701
C  -4.721132 -1.474575 -0.322964
C  -5.682372 -0.527036 0.111749
H  3.677142 -1.94986 -0.900701
H  3.397334 2.100081 0.71127
H  0.930143 1.92767 0.760791
H  5.492159 2.15293 -0.341552
H  5.572888 1.494695 1.335624
H  -1.252728 1.443044 0.685171
H  -3.533118 2.008591 1.034643
H  -2.60449 -1.912736 -0.608774
H  7.900433 1.872015 0.403313
H  7.606766 0.127611 0.692546
H  7.52722 0.782278 -0.969972
H  -5.062694 -2.443787 -0.701533
H  -6.752592 -0.749186 0.075346
H  0.042097 -2.135785 -0.801903
