program: Gaussian 09
title: 000278030
version: EM64L-G09RevD.01
frameworkgroup: C1[X(C15H9F3N2O2)]
method: RPBEPBE
basis: SDD
operation: Freq
keyword: #p
keyword: freq=noraman
keyword: PBEPBE/SDD
title: #p freq=noraman PBEPBE/SDD
converged: YES YES NO NO
title: Mulliken charges:
elementType: F F F O O N N C C C C C C C C C C C C C C C H H H H H H H H H
charge: -0.180193 -0.134849 -0.132321 -0.247639 -0.177075 -0.447280 -0.501933 0.322243 0.061363 0.298539 0.113629 0.389899 -0.014236 -0.393932 -0.363493 -0.346669 -0.345937 -0.266575 -0.235578 -0.237325 0.137271 0.296993 0.331170 0.227543 0.225342 0.281142 0.237932 0.279967 0.347817 0.234519 0.239668
chargesum: 0.00000
title: Mulliken charges with hydrogens summed into heavy atoms:
elementType: F F F O O N N C C C C C C C C C C C C C C C
charge: -0.180193 -0.134849 -0.132321 -0.247639 -0.177075 -0.116111 -0.154116 0.322243 0.061363 0.298539 0.113629 0.389899 -0.014236 -0.166390 -0.138151 -0.065527 -0.065970 -0.028643 -0.001059 0.002342 0.137271 0.296993
polarizability: 2.98897900e+02 2.31541404e+01 2.14689232e+02 5.90941825e+00 -8.29035446e-01 8.22660388e+01
1716.lowfreq: -5.4936 -4.7974 -0.0008 -0.0006 -0.0002 2.8516 14.6472 29.1307 34.5208
frequency: 14.6262 29.0977 34.5136 58.5633 92.4195 96.7671 144.7829 180.5021 197.3303 208.4783 241.7386 254.5529 277.4093 295.4698 325.9882 356.1088 379.9303 420.9149 423.3720 438.1903 460.5008 474.8822 487.9130 508.7713 543.2194 581.0534 588.7339 605.1963 625.2636 631.4832 664.7632 681.3374 694.6388 706.2679 732.6693 740.3668 770.0364 775.0393 794.5076 809.3497 857.4140 872.9063 888.7193 895.4169 910.8801 973.1329 982.0367 1009.0537 1009.5285 1030.8587 1040.8369 1053.4170 1083.6075 1096.3705 1111.7931 1146.1839 1179.1702 1197.5001 1215.7462 1255.0949 1274.1792 1281.7059 1301.5465 1326.3837 1370.5979 1390.8806 1414.7705 1430.4935 1458.3929 1474.2205 1499.5431 1511.8684 1566.1176 1600.9715 1609.9950 1621.5808 1632.7241 1656.3816 3135.7941 3149.0002 3152.8812 3162.0598 3171.4435 3174.5202 3191.7718 3482.1358 3509.0047
redmass: 13.6410 10.5638 9.4557 9.0943 5.9188 4.5317 6.3019 8.1699 8.4875 7.8209 4.5083 6.4741 8.8043 10.1886 7.3923 6.0192 14.1949 3.6576 6.1066 14.1840 6.8759 4.8699 6.6466 8.9696 3.4606 7.1587 4.9135 4.4582 6.7529 1.6275 6.5150 2.1078 4.8669 9.6611 1.8402 2.2372 1.7694 3.4030 2.0542 2.7384 6.1039 4.5485 6.1743 1.5640 1.4709 1.3633 1.3705 1.3592 10.2142 3.1364 11.6743 3.9194 2.7691 2.6743 3.0998 1.7338 1.0758 1.4127 2.7319 1.7245 1.9832 2.6330 3.0088 2.4947 3.1568 8.2754 2.7393 2.9171 2.3863 3.0299 3.1582 2.0728 6.5470 6.4629 6.8266 6.6144 5.0071 9.8745 1.0860 1.0888 1.0880 1.0943 1.0963 1.0976 1.0970 1.0765 1.0759
irintensity: 0.6781 1.4524 1.1543 2.2577 2.6874 1.4783 0.0268 3.5382 3.7987 1.6064 2.6623 6.8436 5.9131 1.7354 3.5350 7.1414 0.6530 4.9994 2.6102 7.2092 3.8841 1.8184 6.0235 4.4372 0.5622 46.4774 7.0001 22.4335 0.8485 45.5817 4.0201 46.7884 15.4095 24.2204 3.9984 26.6932 124.2005 37.8175 4.4929 5.7307 53.5142 22.1722 3.6750 0.0804 3.4281 0.2403 2.5052 1.0223 161.5040 47.6822 228.1295 35.3907 29.4563 67.8458 73.9572 63.6883 2.5488 13.3791 59.6449 2.5541 10.6448 87.6047 12.8818 83.7371 9.5733 42.2789 21.5165 45.1057 23.3558 48.0084 2.6518 202.0811 5.6110 13.1712 78.7302 14.9495 403.8609 291.5129 3.4031 10.9756 0.7093 3.5452 13.5974 29.2640 1.9229 45.5348 35.9741
temp: 298.150 k
press: 1.00000 atm
elementType: 9 9 9 8 8 7 7 6 6 6 6 6 6 6 6 6 6 6 6 6 6 6 1 1 1 1 1 1 1 1 1
symmnumber: 1
zpe: 560494.6 jmol-1
zpe.correction: 0.213481 hartree
zpe.thermalcorrener: 0.231147 hartree
zpe.thermalcorrenthalpy: 0.232092 hartree
zpe.thermalcorrgfe: 0.165473 hartree
zpe.sumelectzpe: -1134.999844 hartree
zpe.sumelectthermal: -1134.982178 hartree
zpe.sumelectthermalent: -1134.981234 hartree
zpe.sumelectthermalfe: -1135.047852 hartree
dipole: -4.5996 3.2357 -1.8570
dipole: 5.9224
quadrupole: -122.8931 -127.4131 -130.3490
quadrupole: -9.6403 -4.7253 -1.8675
quadrupole: 3.9920 -0.5280 -3.4639 -9.6403 -4.7253 -1.8675
hfenergy: -1135.2133254 hartree
pointgroup: C01 [X(C15H9F3N2O2)]
dipole: 1.7695638 -1.3102562 -0.7622206 debye
polarizability: 300.231521|20.6691251|213.2319247|-5.4758072|4.0796168|82.3897255 unknown
InChI: InChI=1S/C15H9F3N2O2/c16-15(17,18)14(22)19-11-7-3-6-9-8-4-1-2-5-10(8)13(21)20-12(9)11/h1-7,19-20H
charge 0 multiplicity 1
31 atoms
F  -3.898032 1.924918 -0.80987
F  -5.536782 0.347256 -0.785113
F  -5.00153 1.44769 1.121357
O  1.602672 3.072344 0.311003
O  -3.791038 -1.227653 1.01065
N  0.389352 1.106732 0.119782
N  -2.181265 0.006241 -0.213159
C  1.418006 -1.108386 -0.033721
C  0.250142 -0.283602 -0.006346
C  2.741047 -0.457578 0.003491
C  2.826163 0.969485 0.088179
C  -1.048468 -0.869331 -0.110578
C  1.608997 1.811347 0.177235
C  1.238584 -2.51652 -0.088002
C  3.960259 -1.192578 -0.052103
C  -1.194391 -2.269686 -0.147921
C  4.08412 1.624203 0.115132
C  -0.044235 -3.090039 -0.122868
C  5.203215 -0.537232 -0.026065
C  5.272281 0.878626 0.057365
C  -3.433395 -0.245913 0.315825
C  -4.469717 0.863715 -0.034387
H  -0.435772 1.690599 0.28839
H  2.111611 -3.174828 -0.095447
H  3.942226 -2.284228 -0.119287
H  -2.192807 -2.709651 -0.194132
H  -0.157614 -4.177783 -0.148165
H  4.089197 2.716647 0.185774
H  -2.095361 0.836485 -0.810394
H  6.12582 -1.126173 -0.071036
H  6.244018 1.382396 0.077508
