program: Gaussian 09
title: 000278027
version: EM64L-G09RevD.01
frameworkgroup: C1[X(C15H14N2O4)]
method: RPBEPBE
basis: SDD
operation: Freq
keyword: #p
keyword: freq=noraman
keyword: PBEPBE/SDD
title: #p freq=noraman PBEPBE/SDD
converged: YES YES NO NO
title: Mulliken charges:
elementType: O O O O N N C C C C C C C C C C C C C C C H H H H H H H H H H H H H H
charge: -0.253401 -0.407893 -0.207556 -0.227833 -0.149541 0.020362 0.149414 0.321647 0.384033 0.165093 -0.490796 0.221643 -0.279961 -0.367795 -0.370353 -0.342569 -0.350389 -0.247354 -0.230263 -0.212234 -0.682510 0.277860 0.245556 0.249655 0.278288 0.260472 0.286304 0.214258 0.214186 0.240165 0.243298 0.210385 0.234631 0.234686 0.368512
chargesum: 0.00000
title: Mulliken charges with hydrogens summed into heavy atoms:
elementType: O O O O N N C C C C C C C C C C C C C C C
charge: -0.253401 -0.039381 -0.207556 -0.227833 -0.149541 0.020362 0.149414 0.321647 0.384033 0.165093 -0.212936 0.221643 -0.034405 -0.118140 -0.092065 -0.082097 -0.064085 0.181089 0.009902 0.031064 -0.002809
polarizability: 5.30666960e+02 1.54259679e+00 2.16851557e+02 2.70613571e+00 -2.52181251e-01 8.31446285e+01
1716.lowfreq: -7.9204 -5.4545 -0.0006 -0.0005 0.0007 3.9561 9.8664 22.4459 34.5251
frequency: 9.5544 22.4330 34.5227 44.5475 68.6156 100.0352 110.7532 126.8816 132.5608 168.1215 189.5063 214.1642 225.7596 244.9422 257.8236 285.8409 328.2647 340.1072 380.2408 381.9540 409.3946 431.9248 447.4435 486.7722 522.2100 535.1093 563.6591 602.7525 619.7038 624.9768 660.1696 662.5233 721.6512 724.0022 739.8522 758.5551 766.6553 783.7910 789.6738 815.3995 829.0828 856.6736 863.0244 870.5349 894.4326 932.1621 957.0758 961.4527 986.8810 1004.8773 1028.9016 1038.3131 1056.7755 1110.3261 1116.4887 1131.2532 1133.5553 1153.6004 1167.9369 1185.7801 1197.0002 1219.3194 1243.0421 1262.4277 1266.0616 1272.3447 1302.8115 1325.7114 1360.7374 1371.8152 1386.4719 1399.8722 1402.5602 1435.3801 1458.9797 1461.1465 1471.3827 1479.1895 1483.1703 1494.4236 1537.0534 1562.8289 1572.0469 1607.1511 1635.6510 2965.2046 2999.4043 3026.5730 3096.7393 3109.3983 3117.0479 3141.1973 3143.8227 3162.8887 3174.4707 3178.0345 3189.4505 3191.4666 3233.8260
redmass: 5.7020 11.3367 4.3883 5.9507 4.8569 2.5030 2.5281 4.2624 3.8692 7.7150 4.9406 3.2052 3.8744 1.5823 3.4312 7.2465 5.1128 4.2903 8.3124 5.2029 5.2457 3.7697 3.1381 7.5152 3.7564 5.6875 6.9029 4.8365 6.1692 3.7962 7.5473 4.8562 3.2748 6.1834 2.8131 1.2429 8.0187 1.3933 1.5020 5.8654 1.1129 4.1923 1.5938 4.8407 1.3695 1.3601 2.6963 1.5900 1.3745 1.3526 2.5357 2.9984 2.9231 2.8344 2.1846 1.8843 1.4293 1.6848 1.5443 2.3381 1.6771 2.0133 1.7610 1.1450 3.8494 1.9711 1.5471 3.0212 1.5041 3.0171 4.1784 2.1861 1.6824 2.7486 2.7799 1.0395 1.5168 2.2823 1.3866 1.5352 4.6976 6.3726 6.0480 6.6056 6.4421 1.0554 1.0364 1.1078 1.0988 1.1016 1.0890 1.0887 1.0871 1.0916 1.0944 1.0945 1.0969 1.0930 1.0618
irintensity: 5.8703 0.6282 0.3892 1.9380 0.4455 2.7170 0.0549 0.6412 1.9149 1.0062 8.9540 2.4346 2.0806 1.4132 0.5422 1.3731 6.6229 2.0158 9.5886 1.4980 2.6399 1.2264 4.3519 5.8452 13.5472 5.9704 52.4298 1.7438 5.2501 4.9914 6.3113 17.1351 3.5231 2.2526 17.0354 60.8433 6.1798 38.9800 110.8010 9.4592 0.0611 12.6412 39.1224 16.8731 0.1262 0.2066 44.0467 23.9201 8.2476 0.4604 107.5032 7.6636 7.8947 218.6596 18.9312 67.7438 4.8584 237.9246 210.8117 391.8996 18.2838 26.5221 1.2812 0.0141 619.2830 34.8412 77.6799 57.1915 5.7004 53.4848 132.3347 183.9958 0.7712 2.9917 169.0412 12.5096 141.0638 34.6430 53.5069 39.6643 146.0067 99.0790 88.2842 12.2415 422.9398 37.4635 33.7565 30.4052 26.9453 32.8417 30.8293 0.6807 3.4223 12.0111 16.2162 9.4170 10.5293 1.2674 67.3569
temp: 298.150 k
press: 1.00000 atm
elementType: 8 8 8 8 7 7 6 6 6 6 6 6 6 6 6 6 6 6 6 6 6 1 1 1 1 1 1 1 1 1 1 1 1 1 1
symmnumber: 1
zpe: 691143.0 jmol-1
zpe.correction: 0.263242 hartree
zpe.thermalcorrener: 0.282353 hartree
zpe.thermalcorrenthalpy: 0.283297 hartree
zpe.thermalcorrgfe: 0.212439 hartree
zpe.sumelectzpe: -988.790399 hartree
zpe.sumelectthermal: -988.771289 hartree
zpe.sumelectthermalent: -988.770345 hartree
zpe.sumelectthermalfe: -988.841203 hartree
dipole: -1.7794 0.9175 -0.0214
dipole: 2.0021
quadrupole: -93.9356 -129.2145 -125.6893
quadrupole: 35.0152 -0.8297 -0.0839
quadrupole: 22.3442 -12.9347 -9.4095 35.0152 -0.8297 -0.0839
hfenergy: -989.0536416 hartree
pointgroup: C01 [X(C15H14N2O4)]
dipole: 0.6827178 -0.390567 -0.0427606 debye
polarizability: 528.5356089|-11.9006341|217.2845775|-27.570849|-0.3338713|84.8429585 unknown
InChI: InChI=1S/C15H14N2O4/c1-2-21-12-7-8-13(15(18)9-12)16-10-11-5-3-4-6-14(11)17(19)20/h3-10,18H,2H2,1H3
charge 0 multiplicity 1
35 atoms
O  5.241902 -0.283902 -0.410969
O  1.204244 -2.849952 -0.159778
O  -4.655363 2.976266 0.344792
O  -2.489518 2.750395 -0.295269
N  -0.352548 -0.721649 -0.123323
N  -3.634943 2.242609 0.03801
C  1.020714 -0.437368 -0.193718
C  -2.714673 -0.163602 -0.016541
C  3.849662 -0.271501 -0.339611
C  1.841659 -1.625005 -0.213485
C  3.239944 -1.546702 -0.285531
C  -3.807905 0.766241 0.060467
C  1.665138 0.828672 -0.248257
C  3.063196 0.922736 -0.320828
C  -1.291918 0.206149 -0.095477
C  -3.06641 -1.54896 0.015394
C  -5.152232 0.327946 0.164415
C  5.960777 1.010132 -0.476883
C  -4.39535 -1.987397 0.106982
C  -5.451566 -1.043164 0.183022
C  7.448115 0.680024 -0.553674
H  3.852278 -2.450613 -0.300655
H  1.072489 1.749952 -0.236678
H  3.535233 1.9074 -0.363162
H  -1.063178 1.277038 -0.135633
H  -2.246191 -2.269506 -0.035561
H  -5.938394 1.083968 0.227547
H  5.623272 1.569494 -1.372559
H  5.724436 1.60522 0.428147
H  -4.614966 -3.060171 0.120838
H  -6.492086 -1.374652 0.254061
H  8.039318 1.612175 -0.60652
H  7.768355 0.11241 0.336323
H  7.667766 0.075056 -1.449549
H  0.221644 -2.615745 -0.116033
