program: Gaussian 09
title: 000277979
version: EM64L-G09RevD.01
frameworkgroup: C1[X(C10H13NO3)]
method: RPBEPBE
basis: SDD
operation: Freq
keyword: #p
keyword: freq=noraman
keyword: PBEPBE/SDD
title: #p freq=noraman PBEPBE/SDD
converged: YES YES NO NO
title: Mulliken charges:
elementType: O O O N C C C C C C C C C C H H H H H H H H H H H H H
charge: -0.292396 -0.268312 -0.287494 -0.618591 -0.562379 0.482122 -0.303939 -0.389010 -0.401095 -0.351243 -0.352021 0.317428 0.298939 -0.538318 0.242194 0.217593 0.234625 0.246747 0.233391 0.244237 0.247907 0.239283 0.220597 0.220467 0.244192 0.335999 0.339076
chargesum: 0.00000
title: Mulliken charges with hydrogens summed into heavy atoms:
elementType: O O O N C C C C C C C C C C
charge: -0.292396 -0.268312 -0.287494 0.056484 -0.102592 0.482122 0.177434 -0.155619 -0.156858 -0.103336 -0.112738 0.317428 0.298939 0.146938
polarizability: 1.88709418e+02 -7.46547062e+00 1.20250956e+02 1.12068919e+01 3.25621548e+00 6.94870107e+01
1716.lowfreq: -13.4123 0.0004 0.0005 0.0008 4.1061 9.0872 27.4463 34.1227 46.3123
frequency: 27.0719 33.7284 46.1922 68.8315 84.4815 112.4960 181.6084 216.3548 246.2859 267.7078 295.7061 342.1006 377.2113 414.1663 423.0843 474.2552 491.6227 515.5944 519.8184 545.7691 623.1539 633.8906 704.4689 713.8001 736.0197 780.3502 805.3742 814.5389 823.3472 844.5431 941.6792 963.0747 988.8803 999.3934 1004.4193 1031.9067 1045.7725 1058.3548 1112.6853 1117.0470 1156.5968 1179.4478 1202.5219 1215.5744 1230.1410 1287.3061 1291.0324 1306.0910 1308.1069 1376.7896 1382.3981 1417.2885 1437.2713 1453.5136 1467.6441 1473.9153 1479.6851 1502.9342 1584.9663 1586.9366 1624.0609 1684.6696 2957.4102 3003.3000 3027.6699 3044.1010 3061.6447 3108.9780 3121.1064 3122.9024 3124.3112 3159.8041 3165.0277 3558.4722 3717.0862
redmass: 4.3189 5.0934 4.4788 4.2135 4.6690 4.1519 3.2039 2.7544 1.3137 2.9555 4.4166 2.8772 4.9232 2.9539 4.0814 3.4828 1.1780 2.6805 1.1242 3.3390 4.9164 6.7608 10.5960 3.8550 4.1408 1.9851 1.7731 1.8198 1.6123 2.2895 1.3859 1.3547 8.5136 5.8624 2.8647 1.7090 4.1086 1.9900 1.2602 1.3091 1.3358 1.2316 1.3477 1.9467 4.2903 1.1797 1.3507 2.3812 1.3867 1.4197 5.1483 3.2822 1.1706 1.0984 1.0501 1.0745 1.0988 2.4840 6.1778 1.2466 6.4546 6.9854 1.0331 1.0593 1.0580 1.1038 1.1029 1.1085 1.0900 1.0935 1.0948 1.0938 1.0952 1.0445 1.1058
irintensity: 2.3294 2.4254 4.8504 2.9726 0.2148 9.1590 0.7566 1.8792 0.4590 12.9462 10.8179 1.2023 9.0369 0.0376 6.5296 13.1277 297.0846 36.0771 15.7939 15.7922 3.1906 0.5194 34.4150 5.5149 11.0099 11.4201 5.5748 31.2224 3.9411 36.0464 1.5546 0.3246 48.4726 167.9861 11.1816 11.5048 73.4997 27.9628 0.2258 20.3211 1.0615 50.2626 14.7669 14.3977 172.3702 0.1719 3.2973 377.5631 57.0342 44.5773 7.4525 1.3135 9.3934 20.8590 13.1767 53.8884 14.2219 120.0460 0.8436 111.8983 40.5723 352.1405 67.1347 16.9244 37.4993 51.3518 5.2136 12.2047 14.8071 41.4024 1.5132 15.0281 5.2770 71.8492 49.2704
temp: 298.150 k
press: 1.00000 atm
elementType: 8 8 8 7 6 6 6 6 6 6 6 6 6 6 1 1 1 1 1 1 1 1 1 1 1 1 1
symmnumber: 1
zpe: 569706.5 jmol-1
zpe.correction: 0.216990 hartree
zpe.thermalcorrener: 0.231090 hartree
zpe.thermalcorrenthalpy: 0.232035 hartree
zpe.thermalcorrgfe: 0.173986 hartree
zpe.sumelectzpe: -668.237656 hartree
zpe.sumelectthermal: -668.223556 hartree
zpe.sumelectthermalent: -668.222611 hartree
zpe.sumelectthermalfe: -668.280660 hartree
dipole: -0.9611 0.3104 0.1164
dipole: 1.0166
quadrupole: -55.1927 -80.2481 -85.7396
quadrupole: -14.9586 2.3374 -0.2210
quadrupole: 18.5341 -6.5213 -12.0128 -14.9586 2.3374 -0.2210
hfenergy: -668.454646 hartree
pointgroup: C01 [X(C10H13N1O3)]
dipole: -0.3864527 0.0872638 0.0549292 debye
polarizability: 187.74826|-9.0946336|112.4985572|15.499491|17.5682435|78.2005675 unknown
InChI: InChI=1S/C10H13NO3/c1-13-9-4-2-8(3-5-9)6-7-14-10(11)12/h2-5H,6-7,11H2,1H3
charge 0 multiplicity 1
27 atoms
O  -3.471451 0.285385 0.327568
O  4.443734 0.145627 0.467155
O  -3.512587 -1.691559 -0.967042
N  -5.432592 -0.389422 -0.599217
C  -1.19753 0.687169 -0.63609
C  0.29528 0.531281 -0.384967
C  -2.011744 0.097854 0.53631
C  1.052817 1.571771 0.217518
C  0.962351 -0.675947 -0.705071
C  2.424883 1.416139 0.488277
C  2.340161 -0.853329 -0.442194
C  3.073549 0.199646 0.159018
C  -4.095062 -0.695661 -0.468075
C  5.158625 -1.090636 0.144776
H  -1.49313 0.158351 -1.560376
H  -1.465387 1.753194 -0.754885
H  -1.804454 0.628397 1.479679
H  -1.800582 -0.979914 0.652281
H  0.561541 2.519406 0.471029
H  0.398895 -1.491891 -1.174696
H  3.013423 2.216899 0.946522
H  2.822319 -1.798624 -0.709172
H  5.136363 -1.298184 -0.94312
H  4.738247 -1.955409 0.694768
H  6.195701 -0.915643 0.466892
H  -5.81851 0.436771 -0.148959
H  -6.02456 -1.012168 -1.14093
