program: Gaussian 09
title: 000277990
version: EM64L-G09RevD.01
frameworkgroup: C1[X(C15H10ClNO2)]
method: RPBEPBE
basis: SDD
operation: Freq
keyword: #p
keyword: freq=noraman
keyword: PBEPBE/SDD
title: #p freq=noraman PBEPBE/SDD
converged: YES YES NO NO
title: Mulliken charges:
elementType: Cl O O N C C C C C C C C C C C C C C C H H H H H H H H H H
charge: -0.048516 -0.174570 -0.134576 -0.246924 0.348727 -0.581184 0.173995 0.062168 0.541796 -0.059373 -0.318351 -0.333407 -0.196546 -0.446121 -0.349931 -0.248860 -0.199608 -0.207236 -0.115172 0.242326 0.270253 0.261421 0.272437 0.234791 0.240107 0.253478 0.240774 0.258422 0.259681
chargesum: 0.00000
title: Mulliken charges with hydrogens summed into heavy atoms:
elementType: Cl O O N C C C C C C C C C C C C C C C
charge: -0.048516 -0.174570 -0.134576 -0.246924 0.348727 -0.068605 0.173995 0.062168 0.541796 -0.059373 -0.056931 -0.060970 0.038246 -0.206014 -0.096452 -0.008086 0.058814 0.052445 -0.115172
polarizability: 2.19819567e+02 -1.76413138e+01 1.85436232e+02 -1.61664537e+01 9.79149253e+00 1.33287390e+02
1716.lowfreq: -4.9833 -0.0022 -0.0019 0.0005 4.0907 6.4889 19.0480 29.2241 37.3052
frequency: 18.9945 29.2065 37.2955 95.5133 102.9186 128.6381 158.4401 196.2597 228.9671 273.3643 293.0877 303.2878 318.4985 353.1948 390.7157 407.2409 411.8856 468.3901 470.1555 483.7976 540.1616 546.5982 597.2855 627.0518 638.8677 685.3334 692.0433 713.9879 726.4842 761.9539 788.1699 810.1814 829.9575 832.6987 848.8884 876.5697 914.0063 951.2097 961.2493 969.4811 992.2068 997.6373 1004.9134 1016.5782 1041.8968 1073.1831 1091.1915 1112.3355 1156.6422 1177.9402 1185.7459 1195.0953 1210.3145 1272.8354 1293.7024 1315.5704 1325.3035 1358.0138 1384.3726 1402.3050 1404.0252 1457.4978 1463.9270 1467.1413 1480.1570 1589.4720 1598.8185 1603.2259 1619.2007 1651.8842 1660.0595 2986.8758 3040.4725 3125.0002 3139.7043 3140.1680 3152.1749 3167.4907 3170.2290 3173.4899 3176.8786
redmass: 5.3806 6.6213 5.9744 9.3851 8.8431 4.8471 7.0247 8.6470 4.3763 6.0172 6.6283 6.6360 7.9842 2.8051 4.7648 3.3686 4.3720 5.2690 6.5162 3.4898 7.2389 4.2023 6.2678 6.8943 5.3191 6.3678 5.5011 3.9538 3.9602 1.4979 3.0988 3.8963 1.8464 1.2786 3.7816 1.4716 4.2335 1.4114 1.4069 1.3763 1.3491 3.8377 3.2379 3.3717 2.5639 2.7808 2.1418 1.3715 1.7891 1.3819 1.1227 2.1253 2.9665 1.3783 1.3728 2.3050 2.2111 1.9973 4.6770 4.4467 2.2336 1.6390 2.8449 1.6663 2.1586 7.3480 7.4427 6.1595 8.1974 11.4270 11.7959 1.0589 1.1028 1.0900 1.0866 1.0897 1.0907 1.0951 1.0950 1.0962 1.0998
irintensity: 1.7199 0.9552 1.3090 0.8523 0.1562 0.9563 0.2173 2.1292 0.7848 1.9998 1.7567 2.2004 2.5206 2.8324 3.0714 5.6161 7.6780 24.5846 10.5326 11.7567 2.7375 5.3249 11.8114 0.2923 6.4395 7.2177 0.9971 2.8629 13.6778 80.3065 20.4287 9.9465 41.4705 1.8260 27.7965 1.1525 8.1704 1.1344 3.3347 0.3089 0.3431 28.3630 55.0048 3.6205 2.0609 43.3116 27.9867 16.5448 16.3006 29.2463 1.5211 3.1352 1.3984 0.4681 16.7734 34.4145 81.3842 4.5232 3.1865 43.7315 2.1913 59.8962 8.4547 125.7395 65.6531 4.6438 86.4562 7.8617 407.0702 195.4834 35.0342 25.1788 9.0950 10.3718 2.5226 5.2274 3.8798 16.5325 4.6037 0.2814 11.7593
temp: 298.150 k
press: 1.00000 atm
elementType: 17 8 8 7 6 6 6 6 6 6 6 6 6 6 6 6 6 6 6 1 1 1 1 1 1 1 1 1 1
symmnumber: 1
zpe: 552421.8 jmol-1
zpe.correction: 0.210406 hartree
zpe.thermalcorrener: 0.225883 hartree
zpe.thermalcorrenthalpy: 0.226828 hartree
zpe.thermalcorrgfe: 0.165121 hartree
zpe.sumelectzpe: -1241.558757 hartree
zpe.sumelectthermal: -1241.543280 hartree
zpe.sumelectthermalent: -1241.542336 hartree
zpe.sumelectthermalfe: -1241.604042 hartree
dipole: -1.5476 5.0729 2.8203
dipole: 6.0070
quadrupole: -134.6872 -121.5571 -108.9108
quadrupole: 17.7389 -0.8896 -0.5495
quadrupole: -12.9688 0.1613 12.8076 17.7389 -0.8896 -0.5495
hfenergy: -1241.7691636 hartree
pointgroup: C01 [X(C15H10Cl1N1O2)]
dipole: -0.1777576 -2.3314058 -0.3438236 debye
polarizability: 211.1043146|26.3836256|195.508912|4.8235388|-9.3980792|131.9299627 unknown
InChI: InChI=1S/C15H10ClNO2/c16-11-7-5-10(6-8-11)9-17-13-4-2-1-3-12(13)14(18)15(17)19/h1-8H,9H2
charge 0 multiplicity 1
29 atoms
Cl -5.393822 -1.255851 1.528028
O  0.952198 3.037202 -1.26208
O  3.486503 2.553402 0.388931
N  0.75262 0.689299 -0.978235
C  1.506202 -0.336423 -0.338873
C  -0.479322 0.497959 -1.757252
C  2.669463 0.216407 0.27661
C  1.371451 1.944753 -0.813424
C  -1.677133 0.044773 -0.925873
C  2.669882 1.672065 0.032694
C  1.234585 -1.712842 -0.273006
C  3.581112 -0.603339 0.96802
C  2.162499 -2.530358 0.424948
C  -2.512952 -1.000649 -1.386363
C  -1.994409 0.690033 0.295389
C  3.32158 -1.992505 1.039594
C  -3.650445 -1.401942 -0.648894
C  -3.122687 0.300447 1.047902
C  -3.935143 -0.743449 0.561741
H  -0.289919 -0.223177 -2.575407
H  -0.684813 1.483158 -2.219313
H  0.337853 -2.147009 -0.723353
H  4.46804 -0.161368 1.433805
H  1.971366 -3.607277 0.491599
H  -2.285042 -1.508193 -2.331922
H  -1.361474 1.505249 0.663576
H  4.01193 -2.655453 1.570043
H  -4.296326 -2.208571 -1.007108
H  -3.367894 0.799257 1.989826
