program: Gaussian 09
title: 000277977
version: EM64L-G09RevD.01
frameworkgroup: C1[X(C10H14O4S)]
method: RPBEPBE
basis: SDD
operation: Freq
keyword: #p
keyword: freq=noraman
keyword: PBEPBE/SDD
title: #p freq=noraman PBEPBE/SDD
converged: YES YES NO NO
title: Mulliken charges:
elementType: S O O O O C C C C C C C C C C H H H H H H H H H H H H H H
charge: 1.071737 -0.432091 -0.266197 -0.520148 -0.523951 -0.561743 0.472696 -0.261472 -0.377697 -0.401454 -0.349881 -0.350944 0.319483 -0.744767 -0.538068 0.227877 0.228780 0.239746 0.240551 0.236163 0.232802 0.250748 0.240522 0.285962 0.307117 0.285662 0.220556 0.221988 0.246023
chargesum: 0.00000
title: Mulliken charges with hydrogens summed into heavy atoms:
elementType: S O O O O C C C C C C C C C C
charge: 1.071737 -0.432091 -0.266197 -0.520148 -0.523951 -0.105087 0.472696 0.218826 -0.141534 -0.168652 -0.099132 -0.110421 0.319483 0.133973 0.150499
polarizability: 2.39696918e+02 -1.02981390e+01 1.31287446e+02 -1.28452480e+01 -1.18224974e+01 1.10791748e+02
1716.lowfreq: -153.2017 -6.9749 -3.1543 0.0011 0.0015 0.0023 3.5436 8.0815 16.6238
frequency: -153.1951 6.3035 14.3375 34.2629 43.9925 80.9976 96.8102 118.3348 156.9778 194.2441 214.4546 222.7022 238.0553 265.9287 296.3110 333.5998 349.9798 353.7568 408.4351 414.4581 435.0255 501.8755 533.2714 562.1074 585.1567 633.3616 713.6093 741.3301 810.6645 814.1147 821.2928 832.5780 837.6963 902.2000 919.8845 941.0326 963.6072 971.3810 988.3098 1002.9836 1013.4044 1030.2426 1041.6160 1112.6745 1117.6694 1156.7224 1174.0595 1181.5920 1213.9398 1231.8593 1268.7744 1279.9526 1291.9998 1307.8087 1355.4299 1383.0081 1417.3479 1418.1245 1420.5593 1437.1560 1467.4133 1470.9900 1473.2898 1486.5771 1503.0547 1584.5495 1623.6710 2959.0682 2987.0058 3011.3874 3037.1307 3046.5725 3051.4315 3080.1185 3120.2554 3124.7445 3125.8909 3162.1921 3167.3493 3192.6244 3195.2305
redmass: 1.0251 5.4107 4.9058 5.6265 4.2890 3.8195 2.5229 4.1379 4.4892 3.3845 3.7427 3.5569 1.4795 3.4793 7.4488 3.1580 8.2371 5.3264 5.0589 3.1212 4.6479 4.5736 2.9208 6.4395 8.4366 6.7617 3.8174 4.5073 1.3064 1.6201 1.9973 9.0382 1.7990 2.2643 4.4399 1.4728 1.3561 1.3847 8.5475 2.6868 2.3215 1.5068 4.4038 1.2599 1.3103 1.3354 1.1569 1.2123 2.1815 4.2008 1.1769 1.1375 1.3741 1.2900 1.2660 5.0164 1.0549 3.3525 1.0544 1.1711 1.0501 1.0895 1.0723 1.0876 2.4642 6.9890 6.4417 1.0330 1.0548 1.0587 1.0239 1.1039 1.1068 1.1073 1.0896 1.0903 1.0984 1.0936 1.0953 1.1081 1.1076
irintensity: 0.0143 0.5090 4.7683 1.9768 0.0308 2.1141 2.9108 14.0528 0.2284 5.0195 1.4134 2.6453 0.4457 10.9549 10.0197 3.8035 12.7550 29.4602 6.3346 0.5831 6.5466 3.7153 76.3037 21.6054 77.6565 0.6551 3.5104 0.9568 12.9618 24.7843 3.3587 48.6314 63.6911 24.4098 78.0305 6.2249 0.3997 46.6560 41.8747 9.6746 74.4224 0.9937 4.8096 0.2641 16.3950 1.4319 6.3976 60.7925 9.3478 189.9893 0.3592 4.8348 1.1218 0.8445 2.8523 9.5772 13.9897 1.9389 16.8827 11.1622 13.7203 24.8246 51.5076 20.4137 115.4888 8.7895 62.7177 69.9614 30.9720 27.6127 0.3026 49.2062 1.8071 23.6384 18.1733 23.2598 13.7853 15.1169 5.0844 0.0116 0.0618
temp: 298.150 k
press: 1.00000 atm
elementType: 16 8 8 8 8 6 6 6 6 6 6 6 6 6 6 1 1 1 1 1 1 1 1 1 1 1 1 1 1
symmnumber: 1
zpe: 586648.2 jmol-1
zpe.correction: 0.223442 hartree
zpe.thermalcorrener: 0.239822 hartree
zpe.thermalcorrenthalpy: 0.240766 hartree
zpe.thermalcorrgfe: 0.174894 hartree
zpe.sumelectzpe: -1087.072259 hartree
zpe.sumelectthermal: -1087.055879 hartree
zpe.sumelectthermalent: -1087.054935 hartree
zpe.sumelectthermalfe: -1087.120807 hartree
dipole: -0.6918 -0.3147 -3.6007
dipole: 3.6801
quadrupole: -72.6025 -97.2249 -102.9147
quadrupole: -17.8507 -13.3538 -2.0124
quadrupole: 18.3115 -6.3109 -12.0006 -17.8507 -13.3538 -2.0124
hfenergy: -1087.295701 hartree
pointgroup: C01 [X(C10H14O4S1)]
dipole: 0.2887066 -0.0799155 -1.4165217 debye
polarizability: 240.0974831|-1.3307405|133.8060625|14.7350797|9.0089754|107.8725668 unknown
InChI: InChI=1S/C10H14O4S/c1-13-10-5-3-9(4-6-10)7-8-14-15(2,11)12/h3-6H,7-8H2,1-2H3
charge 0 multiplicity 1
29 atoms
S  -4.239066 -0.673652 0.418126
O  -2.8898 0.023992 -0.68382
O  4.854261 0.329942 0.739735
O  -4.41828 0.263102 1.727143
O  -3.997847 -2.265648 0.600719
C  -0.574122 0.398245 -1.219295
C  0.869763 0.359011 -0.737524
C  -1.531228 -0.075965 -0.101757
C  1.459589 1.48755 -0.106171
C  1.651503 -0.813086 -0.869486
C  2.781296 1.448508 0.372722
C  2.981796 -0.874306 -0.394942
C  3.547839 0.264194 0.230686
C  -5.616896 -0.330325 -0.859794
C  5.685476 -0.87067 0.627015
H  -0.716107 -0.255068 -2.098839
H  -0.861685 1.423381 -1.514439
H  -1.45148 0.574801 0.789243
H  -1.314744 -1.124441 0.179583
H  0.877639 2.410889 0.004504
H  1.220514 -1.696275 -1.357604
H  3.241767 2.316362 0.854493
H  3.556937 -1.796652 -0.519505
H  -6.320315 0.348448 -0.360554
H  -5.111501 0.130248 -1.717965
H  -6.053289 -1.309931 -1.093877
H  5.846863 -1.151634 -0.432146
H  5.237481 -1.723776 1.17306
H  6.646141 -0.598944 1.088391
