program: Gaussian 09
title: 000278083
version: EM64L-G09RevD.01
frameworkgroup: C1[X(C25H34)]
method: RPBEPBE
basis: SDD
operation: Freq
keyword: #p
keyword: freq=noraman
keyword: PBEPBE/SDD
title: #p freq=noraman PBEPBE/SDD
converged: YES YES NO NO
title: Mulliken charges:
elementType: C C C C C C C C C C C C C C C C C C C C C C C C C H H H H H H H H H H H H H H H H H H H H H H H H H H H H H H H H H H
charge: 0.023332 -0.484933 -0.496151 -0.451092 -0.437933 -0.422044 -0.396991 -0.471691 0.054012 -0.456940 -0.475640 -0.587102 -0.599909 0.507249 0.516357 -0.415480 -0.421348 -0.418866 -0.408644 -0.229857 -0.228488 -0.229404 -0.230509 -0.244970 -0.245421 0.200329 0.223711 0.189730 0.200888 0.219521 0.198281 0.199882 0.204444 0.213048 0.211521 0.207787 0.191638 0.211392 0.200250 0.200644 0.202925 0.213740 0.212736 0.212447 0.219571 0.218450 0.199009 0.216316 0.222382 0.230922 0.232581 0.231298 0.226725 0.222151 0.222000 0.222203 0.221805 0.226279 0.225857
chargesum: 0.00000
title: Mulliken charges with hydrogens summed into heavy atoms:
elementType: C C C C C C C C C C C C C C C C C C C C C C C C C
charge: 0.223660 -0.071492 -0.075742 -0.052930 -0.020441 -0.002736 0.006038 -0.070796 0.256938 -0.030464 -0.043622 -0.169643 -0.161211 0.507249 0.516357 -0.184557 -0.188768 -0.187568 -0.181920 -0.007706 -0.006488 -0.007201 -0.008703 -0.018691 -0.019564
polarizability: 3.25657736e+02 -2.20690904e+00 2.47568394e+02 -5.32509080e+00 -1.49736308e+01 2.08992847e+02
1716.lowfreq: -28.4122 -2.9748 -2.4981 -0.0007 -0.0005 0.0007 5.3385 13.2865 17.6117
frequency: -28.3187 13.2147 17.5423 20.2878 23.2355 26.8437 41.2655 48.9029 55.9325 70.6573 89.9507 98.2733 112.3265 120.1269 151.8779 185.3014 212.6087 254.1946 257.3638 260.6024 313.1749 329.3095 338.9811 345.9795 383.9869 403.7952 404.2065 424.9262 470.3730 490.2431 502.6096 527.0328 576.4756 581.9174 614.0199 617.7858 617.9100 623.7209 704.7735 705.7761 728.1870 754.3073 756.5580 758.3481 763.4521 771.0154 796.8395 812.2132 817.6081 822.4028 850.4312 853.1197 853.8104 868.6836 891.5912 908.9214 913.2062 927.6502 945.0651 950.1113 963.5118 969.3584 974.4929 975.2010 984.3978 989.8243 989.9131 991.9786 992.4791 1006.4868 1024.2263 1026.1915 1029.5810 1047.4007 1050.8454 1057.9446 1063.7200 1079.7161 1090.2535 1101.7451 1112.1314 1118.1325 1136.2582 1160.1390 1170.8208 1171.0773 1177.7208 1181.5804 1185.5408 1185.9163 1189.4653 1205.3999 1217.8119 1219.2803 1226.3907 1235.8618 1252.2299 1262.6109 1268.4211 1276.3570 1282.5108 1283.1735 1286.8100 1292.7418 1301.5985 1305.0254 1313.9753 1316.4008 1321.0050 1326.6785 1328.0324 1338.0784 1343.0215 1352.4711 1355.4655 1361.9749 1382.3856 1382.6503 1439.8879 1440.2108 1454.1208 1462.1732 1463.0013 1464.2917 1466.9318 1470.1679 1473.2822 1480.1888 1482.0909 1483.6596 1484.2002 1488.4330 1490.3596 1592.5673 1592.6223 1613.7143 1614.0481 2937.0718 2943.6535 2949.1253 2956.4324 2964.3243 2967.5506 2970.4891 2976.0376 2976.5356 2980.7335 2989.8335 2989.9860 2993.3133 3006.9188 3008.7937 3017.1833 3018.8502 3028.9331 3035.5717 3048.2051 3048.4383 3052.0533 3053.2421 3074.2404 3109.5763 3112.1483 3113.2786 3113.4682 3129.3488 3129.8411 3141.0528 3141.1993 3160.5144 3160.5893
redmass: 1.7608 4.7173 3.8491 3.7859 4.2311 4.0976 2.7035 3.0158 3.5173 3.5217 3.6125 3.9074 2.8373 2.6546 3.4824 2.4694 2.2795 3.3602 2.1977 3.4044 2.8868 2.2636 2.4732 2.8341 2.5434 2.8192 2.8282 1.9696 2.9274 3.3900 3.0774 3.2218 3.0587 2.7405 3.0146 6.3346 6.3434 3.5374 1.7990 1.7576 1.6267 1.3141 1.7462 1.4231 1.3716 1.3960 1.9324 1.7841 2.6576 2.6851 1.8420 1.3062 1.4617 2.3733 2.3679 1.6222 1.4694 1.6248 2.0303 1.8403 1.9039 1.4561 1.3906 1.3936 1.6289 6.2566 6.1303 1.3144 1.3138 1.9466 2.4322 2.1704 2.3637 2.2453 2.6500 1.8609 1.8411 2.2287 1.6296 1.9593 2.0005 1.7686 1.2292 1.4635 1.0552 1.0528 1.4708 1.5134 1.1147 1.1159 1.3896 1.4468 2.4426 2.4322 1.3422 1.2910 1.2835 1.2710 1.2559 1.3463 1.2337 1.2466 1.2072 1.2605 1.2759 1.2993 1.3094 1.3151 1.4098 1.2609 1.2427 1.4430 1.5065 1.4440 1.5880 1.4389 7.6725 7.3809 2.1566 2.1715 1.0770 1.0843 1.0917 1.0882 1.0927 1.0857 1.0856 1.2898 1.5987 1.7148 1.4205 1.0960 1.0988 6.0217 6.0348 6.1914 6.1832 1.0786 1.0810 1.0619 1.0603 1.0596 1.0610 1.0629 1.0616 1.0642 1.0611 1.0609 1.0615 1.0964 1.0675 1.0990 1.0982 1.0997 1.1016 1.0981 1.1013 1.1011 1.1034 1.1019 1.1046 1.0874 1.0870 1.0867 1.0867 1.0904 1.0907 1.0956 1.0958 1.1014 1.1014
irintensity: 0.0048 0.0024 0.0087 0.0051 0.0025 0.0027 0.0111 0.0148 0.0177 0.0654 0.0206 0.2688 0.4792 0.0419 0.2969 0.0644 0.0714 0.1950 0.0513 0.9700 0.1857 0.0830 0.4870 0.2058 0.2697 0.0007 0.0037 0.2323 1.4370 1.9205 8.4398 19.5683 5.2098 8.6252 3.4457 0.0559 0.1426 1.7691 37.3124 63.8348 5.8567 4.7534 44.1483 20.4924 27.4702 2.5876 0.9108 2.6644 5.8792 1.5426 1.8046 0.2868 0.5428 1.7604 3.5202 2.2943 2.8279 0.3127 5.8721 1.0393 2.5117 2.5313 0.0818 0.0145 0.7818 0.0221 0.0669 0.1451 0.1863 1.0299 0.9134 8.4107 13.1097 6.6102 3.0964 6.9471 0.1990 1.4287 2.7417 0.7833 1.4177 2.7739 5.8317 4.1501 0.0097 0.1662 0.6598 1.1723 0.3036 0.3538 12.0414 6.9469 0.0546 0.7982 1.5118 2.5778 0.8860 1.8208 2.8510 8.7416 2.2949 6.4160 0.4843 0.8293 2.0590 2.0667 0.2616 0.9243 3.4608 0.6063 0.1651 2.9787 1.8292 6.1975 2.7204 1.1043 0.3100 0.1437 6.1394 6.6982 1.3987 1.5034 4.6456 2.2683 7.9683 8.8501 12.1567 6.7030 26.0290 31.0760 0.8270 9.0075 0.7241 0.8717 1.6311 21.5334 7.3567 9.1644 8.8545 14.1821 45.3473 23.5018 26.7608 48.9227 9.6598 67.3480 42.1171 36.0953 40.7504 4.2622 56.1649 15.8970 41.9751 22.1258 104.9381 52.7426 21.1856 55.7293 42.2372 19.1217 115.1505 13.5659 10.0489 9.3535 8.6346 10.8702 10.8530 44.5918 49.7449 36.4320 17.5783
temp: 298.150 k
press: 1.00000 atm
elementType: 6 6 6 6 6 6 6 6 6 6 6 6 6 6 6 6 6 6 6 6 6 6 6 6 6 1 1 1 1 1 1 1 1 1 1 1 1 1 1 1 1 1 1 1 1 1 1 1 1 1 1 1 1 1 1 1 1 1 1
symmnumber: 1
zpe: 1368360.0 jmol-1
zpe.correction: 0.521181 hartree
zpe.thermalcorrener: 0.545447 hartree
zpe.thermalcorrenthalpy: 0.546391 hartree
zpe.thermalcorrgfe: 0.461165 hartree
zpe.sumelectzpe: -971.177204 hartree
zpe.sumelectthermal: -971.152938 hartree
zpe.sumelectthermalent: -971.151994 hartree
zpe.sumelectthermalfe: -971.237220 hartree
dipole: -0.3653 -0.5797 0.0299
dipole: 0.6859
quadrupole: -149.8197 -156.5727 -149.7012
quadrupole: 3.0982 -1.8516 -4.0414
quadrupole: 2.2115 -4.5415 2.3300 3.0982 -1.8516 -4.0414
hfenergy: -971.698385 hartree
pointgroup: C01 [X(C25H34)]
dipole: 0.1356297 -0.2330385 -0.0107735 debye
polarizability: 325.6891672|-0.5194282|247.6854227|-5.115616|14.9264072|208.8443872 unknown
InChI: InChI=1S/C25H34/c1-3-10-23(11-4-1)18-20-25(17-9-16-22-14-7-8-15-22)21-19-24-12-5-2-6-13-24/h1-6,10-13,22,25H,7-9,14-21H2
charge 0 multiplicity 1
59 atoms
C  3.527423 -2.977639 -0.238398
C  3.994936 -3.946059 0.879863
C  4.572248 -1.82863 -0.145069
C  2.058816 -2.522072 -0.10466
C  5.54125 -3.949947 0.756746
C  5.917718 -2.509174 0.2682
C  1.586568 -1.594254 -1.249521
C  0.073043 -1.265787 -1.209383
C  -0.423851 -0.530094 0.069263
C  -1.951749 -0.250581 0.009896
C  0.373271 0.769947 0.375238
C  -2.835196 -1.530508 0.055456
C  0.313429 1.864884 -0.730048
C  -4.319864 -1.203098 0.121446
C  1.131134 3.091707 -0.353763
C  -4.970313 -1.026422 1.370583
C  0.537051 4.18278 0.332045
C  -5.079873 -1.023052 -1.063512
C  2.519726 3.154443 -0.642016
C  -6.338738 -0.679659 1.436359
C  1.305685 5.303888 0.719823
C  -6.448577 -0.675451 -1.004347
C  3.293398 4.272453 -0.257103
C  -7.083769 -0.501536 0.247317
C  2.688451 5.352654 0.427067
H  3.652419 -3.490661 -1.217472
H  3.55318 -4.955381 0.787731
H  3.688189 -3.536654 1.864445
H  4.24586 -1.114185 0.637923
H  4.664005 -1.258137 -1.0868
H  1.397016 -3.41365 -0.072585
H  1.9396 -2.008781 0.872413
H  6.039007 -4.215774 1.70661
H  5.854107 -4.700264 0.005977
H  6.620239 -2.556477 -0.583826
H  6.421849 -1.932191 1.064639
H  1.813378 -2.085171 -2.219027
H  2.179961 -0.658345 -1.235105
H  -0.485845 -2.217931 -1.31254
H  -0.191553 -0.657523 -2.099334
H  -0.256564 -1.207843 0.935564
H  -2.233242 0.396221 0.865994
H  -2.201307 0.319747 -0.907691
H  -0.006976 1.206651 1.321092
H  1.436889 0.521222 0.560784
H  -2.629135 -2.149795 -0.837729
H  -2.539161 -2.129994 0.93957
H  0.691925 1.441946 -1.680256
H  -0.74048 2.154807 -0.901016
H  -4.399881 -1.168264 2.297522
H  -0.536638 4.154346 0.557789
H  -4.595173 -1.161915 -2.038406
H  2.99477 2.322632 -1.178589
H  -6.824305 -0.55293 2.410976
H  0.827397 6.139073 1.244629
H  -7.019685 -0.544815 -1.930858
H  4.363347 4.304408 -0.493565
H  -8.145709 -0.235242 0.295517
H  3.285498 6.222477 0.72364
