program: Gaussian 09
title: 000277972
version: EM64L-G09RevD.01
frameworkgroup: C1[X(C6H11NO4)]
method: RPBEPBE
basis: SDD
operation: Freq
keyword: #p
keyword: freq=noraman
keyword: PBEPBE/SDD
title: #p freq=noraman PBEPBE/SDD
converged: YES YES NO NO
title: Mulliken charges:
elementType: O O O O N C C C C C C H H H H H H H H H H H
charge: -0.240030 -0.197410 -0.216575 -0.245698 0.143883 -0.077063 -0.372053 -0.341522 -0.682412 0.297395 -0.749249 0.291031 0.217468 0.228833 0.265187 0.236102 0.222405 0.234431 0.226521 0.247557 0.253171 0.258027
chargesum: 0.00000
title: Mulliken charges with hydrogens summed into heavy atoms:
elementType: O O O O N C C C C C C
charge: -0.240030 -0.197410 -0.216575 -0.245698 0.143883 0.213968 0.074248 0.159768 0.000945 0.297395 0.009507
polarizability: 9.29757411e+01 2.78592682e+00 8.15157370e+01 -6.86899493e+00 4.84766415e-01 8.01696469e+01
1716.lowfreq: -14.5894 -7.3531 0.0011 0.0013 0.0014 8.6588 33.0593 37.9859 50.0062
frequency: 32.9954 37.9551 49.9233 57.3530 71.8362 93.0885 169.7748 188.4300 214.1756 275.4809 306.6892 326.6084 408.4674 459.5834 491.2959 570.3157 588.5061 626.1435 678.9762 767.5694 772.6984 813.4708 911.0275 952.0397 984.7902 999.3836 1039.3937 1044.0304 1075.9634 1111.3217 1131.0782 1195.2775 1212.4427 1248.4681 1262.4013 1284.1697 1309.4244 1347.7948 1368.5341 1387.3315 1401.7893 1430.2878 1437.3292 1452.2841 1453.1203 1460.6830 1478.1712 1485.9908 1656.0071 2989.3707 2996.9353 3008.2398 3038.7230 3050.8946 3082.7061 3089.7480 3091.9164 3098.9650 3127.1024 3144.8806
redmass: 6.4600 1.1077 5.8296 5.8905 3.0784 2.5331 3.6123 5.5516 1.4977 2.1908 3.1864 2.7289 3.3382 4.2061 5.0406 3.1470 2.8775 4.6845 4.7973 2.7310 4.1340 1.9793 1.8799 3.4138 1.9159 2.1522 3.3952 1.6623 1.8702 2.3262 2.5518 3.3816 2.4939 1.2216 2.2438 1.1951 1.2849 1.4489 1.2921 1.2482 1.2016 1.8594 1.4841 1.0563 1.0528 1.1429 1.0558 1.0472 8.9970 1.0361 1.0600 1.0380 1.0598 1.1002 1.0907 1.0984 1.0996 1.0952 1.1054 1.1018
irintensity: 2.2336 2.0789 1.2395 1.7603 3.9395 0.8072 2.2599 1.2980 2.6308 2.9657 5.9926 8.7034 6.7514 4.2506 11.9669 5.6496 1.3088 6.9318 3.5857 24.2421 25.5415 4.3005 13.8268 17.3391 26.9618 69.7144 23.7244 9.2536 10.6514 3.6638 7.8074 276.2773 50.6504 11.4389 37.8587 6.7686 22.5373 3.0233 6.0598 50.7486 11.7360 107.9814 25.6274 25.0411 20.5154 5.3136 13.0656 17.1146 159.2706 20.8208 17.0742 0.6504 18.9675 1.9887 2.4264 30.4767 31.2646 6.0439 1.8022 7.5466
temp: 298.150 k
press: 1.00000 atm
elementType: 8 8 8 8 7 6 6 6 6 6 6 1 1 1 1 1 1 1 1 1 1 1
symmnumber: 1
zpe: 453632.0 jmol-1
zpe.correction: 0.172779 hartree
zpe.thermalcorrener: 0.185630 hartree
zpe.thermalcorrenthalpy: 0.186574 hartree
zpe.thermalcorrgfe: 0.131142 hartree
zpe.sumelectzpe: -589.929024 hartree
zpe.sumelectthermal: -589.916173 hartree
zpe.sumelectthermalent: -589.915229 hartree
zpe.sumelectthermalfe: -589.970661 hartree
dipole: 0.7373 -2.3283 1.0205
dipole: 2.6469
quadrupole: -58.3548 -73.8930 -66.6246
quadrupole: 12.1503 0.0603 -2.8028
quadrupole: 7.9360 -7.6022 -0.3338 12.1503 0.0603 -2.8028
hfenergy: -590.101803 hartree
pointgroup: C01 [X(C6H11N1O4)]
dipole: -0.3265994 0.9777937 0.1473925 debye
dipolederiv: -1.2381324 -0.018557 -0.398338 -0.0543577 -0.4032864 0.1097635 -0.6097011 0.0986804 -0.7425859 -0.2161767 0.0968915 -0.0333166 0.0692253 -0.5354085 -0.2578269 -0.0874421 -0.0758546 -0.6313359 -0.2902603 0.0677782 -0.1722036 0.1239103 -0.4706617 0.1240574 -0.0881222 -0.0772205 -0.6902136 -0.5792302 -0.1629968 -0.0254601 0.0802355 -0.7308079 0.3431397 -0.2519894 0.2030641 -0.5784491 0.1420378 -0.2380692 0.2602909 -0.2768638 0.8550831 0.0902863 0.2250075 0.1326861 1.0661707 0.0500705 -0.0178435 -0.0236762 0.0005989 0.0269624 -0.0539202 0.0476975 -0.0440928 0.0181568 0.0490734 0.1056883 -0.0044195 0.0903167 0.1063497 -0.0211092 0.0435664 0.0091597 0.1067302 0.7490847 0.0248254 0.1031565 0.1883773 0.1840774 0.1433231 0.0167932 0.0782189 0.2435564 -0.0305283 -0.0099049 0.0463699 -0.0436918 0.0374433 -0.0151547 0.0368994 -0.0205257 0.0426608 1.2478073 0.2546083 0.4747378 -0.0069869 0.9049446 -0.4793269 0.8859368 -0.3358728 0.9610085 -0.211125 -0.1633593 -0.0548612 -0.267918 -0.2205599 -0.040815 -0.0860295 -0.0315264 -0.0107194 0.0801112 0.019708 -0.0238026 0.0074765 0.0087727 -0.0270259 -0.0497168 -0.0048987 -0.0149686 0.0147494 0.0613603 0.0114799 0.085236 -0.1098968 0.0079591 0.0017753 0.0168487 0.0911322 0.0420505 -0.0275001 -0.001875 -0.0070014 0.0893574 0.0384592 -0.0299191 -0.0191125 -0.1148923 0.0196929 -0.026328 -0.068487 -0.026617 0.1111599 0.0483855 -0.0280302 -0.0037633 -0.0114498 0.0027353 0.0462309 -0.0113626 -0.0446367 -0.0721552 -0.0417648 0.0176811 0.0244235 0.1133577 0.0465821 0.0155812 -0.092723 0.0167425 0.0983485 -0.009924 -0.0313833 0.005811 -0.1205221 0.0632935 0.0625345 0.0039674 0.1151888 -0.0842059 0.0214982 -0.0073015 0.0470201 0.0580505 -0.0747756 -0.1270181 0.0076647 -0.1414561 -0.0153661 -0.0119918 -0.0025336 -0.0283943 0.0924932 -0.00739 0.0136182 -0.0719538 0.0568721 0.0716203 0.0633082 -0.0914317 0.0519221 0.0598808 0.078667 -0.0404478 0.0280251 -0.0104687 0.1293705 0.0292832 0.0713043 0.0432257 -0.0384496 0.0616626 0.0631999 0.0467873 0.0458182 0.0188585 -0.0606039 0.0169389 -0.0697987 0.1003885 unknown
polarizability: 91.9109011|4.7012727|81.4520972|6.7464753|-0.281049|81.2981266 unknown
InChI: InChI=1S/C6H11NO4/c1-3-6(7(9)10)4-11-5(2)8/h6H,3-4H2,1-2H3
charge 0 multiplicity 1
22 atoms
O  -1.46728 -0.197988 0.615434
O  1.335626 -1.897085 -0.867809
O  1.754322 -1.389962 1.317014
O  -2.076241 1.25605 -1.103975
N  1.344986 -1.092675 0.133649
C  0.858417 0.34944 -0.101717
C  2.050573 1.316858 0.084501
C  -0.282558 0.65501 0.878827
C  3.224353 1.040601 -0.877623
C  -2.302052 0.220102 -0.440167
C  -3.438772 -0.754643 -0.628119
H  0.499973 0.358528 -1.143618
H  1.661118 2.338879 -0.086127
H  2.393738 1.263797 1.13502
H  0.011021 0.412738 1.911533
H  -0.561667 1.718482 0.778779
H  2.896282 1.075071 -1.932378
H  3.678648 0.050492 -0.695302
H  4.014249 1.799982 -0.742154
H  -4.21196 -0.306847 -1.268842
H  -3.865467 -1.047032 0.344866
H  -3.05911 -1.673297 -1.111195
