program: Gaussian 09
title: 000277954
version: EM64L-G09RevD.01
frameworkgroup: C1[X(C8H15NO)]
method: RPBEPBE
basis: SDD
operation: Freq
keyword: #p
keyword: freq=noraman
keyword: PBEPBE/SDD
title: #p freq=noraman PBEPBE/SDD
converged: YES YES NO NO
title: Mulliken charges:
elementType: O N C C C C C C C C H H H H H H H H H H H H H H H
charge: -0.283455 -0.365407 -0.057107 -0.419360 -0.364751 -0.434882 -0.472158 -0.363934 0.136351 -0.693691 0.219862 0.217367 0.206515 0.210265 0.188352 0.220316 0.214720 0.234420 0.248337 0.313389 0.192449 0.207466 0.209477 0.214983 0.220477
chargesum: 0.00000
title: Mulliken charges with hydrogens summed into heavy atoms:
elementType: O N C C C C C C C C
charge: -0.283455 -0.052018 0.162755 0.004522 0.033867 0.000153 0.010599 0.035981 0.136351 -0.048754
polarizability: 1.09182727e+02 -3.36102937e+00 9.41110007e+01 5.58621231e+00 -1.14462788e+00 7.66668961e+01
1716.lowfreq: -13.1885 0.0000 0.0006 0.0008 17.8398 22.4242 52.6571 73.2242 89.3279
frequency: 52.0446 73.1825 89.1010 116.7848 154.8401 228.8185 265.0924 302.5694 362.0106 408.9467 463.0993 477.8388 487.5143 545.5571 664.1176 686.2332 735.5948 757.3610 827.4902 865.9450 878.2143 896.7761 924.6242 960.0785 996.0936 1043.4979 1053.2684 1089.5954 1098.6610 1108.1310 1142.6887 1169.6780 1181.0133 1233.3162 1257.6818 1264.2988 1290.9844 1306.4384 1321.5739 1329.9188 1336.4622 1349.0459 1354.0179 1382.2356 1388.0544 1422.0683 1450.5051 1454.8867 1466.5578 1474.0467 1477.1188 1482.1839 1485.4014 1617.9075 2955.8202 2960.9487 2969.6619 2974.8249 2989.5545 2991.8867 2993.2440 3007.9923 3038.0313 3048.1970 3054.3318 3071.4247 3071.9898 3075.8796 3511.3460
redmass: 2.6622 1.9009 3.4546 2.8522 2.7197 1.1119 2.2541 3.2953 2.4484 3.5433 3.0389 2.1491 3.7385 2.8942 2.0058 1.4348 2.0641 1.4735 1.8019 1.8308 1.8999 1.6281 1.9795 2.6101 1.9932 1.6557 2.4736 1.4968 2.2995 1.5944 1.4780 2.2741 1.5693 1.3502 1.2352 1.2843 1.1517 1.6249 1.3471 1.6337 1.3586 1.5001 1.5398 1.7162 1.2106 1.9688 1.1595 1.0936 1.0873 1.0570 1.0425 1.0883 1.0795 5.4136 1.0821 1.0593 1.0609 1.0362 1.0639 1.0661 1.0636 1.0977 1.1026 1.0983 1.1013 1.1003 1.0974 1.0995 1.0754
irintensity: 0.8860 0.4840 1.5737 0.1208 0.3897 0.0009 0.5666 0.8685 1.4441 7.1318 2.8044 6.3526 8.7958 16.0231 5.7986 104.7246 16.0748 5.2689 6.6321 3.0277 1.8896 6.3956 6.5598 13.6623 4.5834 2.4950 2.4719 8.8991 6.1169 2.3681 15.9812 22.7113 4.9249 1.8489 0.2488 4.2289 7.4944 22.6450 2.0069 79.5719 10.6206 2.1205 4.9843 38.6216 10.4685 51.8584 1.9956 1.2349 14.3890 4.0305 12.4395 11.5128 15.4536 357.4970 23.5531 14.3058 46.6445 41.3253 43.0202 13.7640 27.6361 3.5147 42.5385 43.0588 52.3243 52.7159 47.7010 47.2113 9.5001
temp: 298.150 k
press: 1.00000 atm
elementType: 8 7 6 6 6 6 6 6 6 6 1 1 1 1 1 1 1 1 1 1 1 1 1 1 1
symmnumber: 1
zpe: 579987.3 jmol-1
zpe.correction: 0.220905 hartree
zpe.thermalcorrener: 0.231600 hartree
zpe.thermalcorrenthalpy: 0.232545 hartree
zpe.thermalcorrgfe: 0.184133 hartree
zpe.sumelectzpe: -443.037500 hartree
zpe.sumelectthermal: -443.026805 hartree
zpe.sumelectthermalent: -443.025861 hartree
zpe.sumelectthermalfe: -443.074273 hartree
dipole: 2.6885 -3.9097 0.7301
dipole: 4.8007
quadrupole: -65.4405 -69.6009 -60.4031
quadrupole: 10.6265 0.7915 1.3238
quadrupole: -0.2924 -4.4527 4.7450 10.6265 0.7915 1.3238
hfenergy: -443.2584057 hartree
pointgroup: C01 [X(C8H15N1O1)]
dipole: -1.0782665 1.545261 0.1297813 debye
dipolederiv: -0.7552864 0.2085916 0.0997338 0.5011575 -1.1063751 -0.0296711 0.0919175 0.0467237 -0.4245442 -1.1141476 0.4025669 0.0694946 0.1700545 -0.4267434 -0.0592594 0.2253633 -0.2269476 -0.5095011 0.4041713 -0.1182523 0.046271 -0.3435247 0.4001561 0.0514465 0.0944445 0.0358463 0.318836 0.0038998 -0.0162602 0.0575953 0.0251052 0.061359 0.0066804 0.0289166 0.0045465 0.0789495 -0.0497403 -0.0395118 -0.0640174 -0.0311601 0.0247183 0.0105255 -0.0918762 0.0294034 0.042087 0.0652981 0.0184478 0.0440048 0.0239891 0.0678978 0.0088175 0.0542554 -0.0013769 0.0733592 -0.0335253 -0.1307378 0.1159906 -0.0981741 -0.1438304 0.0992756 0.1010147 0.0872946 0.0759794 0.0452981 -0.0337211 -0.0604961 0.0081917 0.1012768 0.0276815 -0.0869434 0.0216303 0.1318494 1.3704988 -0.4599761 -0.4333636 -0.4137075 1.1646402 -0.0256905 -0.5821719 0.0894318 0.3583367 -0.0291222 -0.0224469 -0.0517509 -0.0448205 0.0740154 0.0008303 -0.0289497 0.0082162 0.0533262 -0.040061 0.0463541 0.0908396 0.0596775 0.0023334 0.0025262 0.0888997 -0.0333187 -0.1637043 -0.0740344 -0.0802632 -0.1099037 -0.0469284 0.064624 -0.0119616 -0.0887228 -0.0480124 -0.0915369 -0.0119731 0.1428789 0.0124283 0.1210889 -0.0988979 0.0040452 0.0041312 0.0341644 0.0679811 0.037884 -0.0078041 0.0710511 -0.0082435 0.0606929 -0.0216272 0.0602052 0.0093457 -0.1392052 -0.0297415 0.1048486 0.0034522 0.0944002 -0.1534426 -0.0098367 -0.0015308 -0.0116646 0.0711667 -0.030162 -0.1167833 0.0621239 -0.1112778 -0.1212419 0.0810167 0.0470778 0.058941 0.056091 -0.0175212 0.0292851 -0.1323063 0.004689 0.0522488 -0.0615536 -0.1116812 -0.0300891 -0.0798999 -0.0160979 -0.0135496 -0.0789222 -0.0511139 0.0319517 -0.0088514 -0.1240189 -0.0093825 0.0007106 0.0579639 0.0450112 0.0620936 0.0637045 0.0289362 -0.0611746 0.1010007 -0.0365136 -0.0372465 0.1911251 -0.0121958 0.1010768 -0.0025779 0.0662357 0.0285834 0.1192337 -0.0011088 0.2718924 0.0273553 -0.0201842 0.0209983 -0.0125827 0.059728 -0.0346797 0.051429 0.0037002 -0.2018569 0.0097915 0.1088357 -0.0064737 0.0927678 -0.1362745 -0.0005966 0.0097425 -0.0134451 0.0611877 0.0196517 0.078647 -0.0099712 0.147277 -0.1207954 -0.0182057 -0.0023761 -0.0437633 0.0724904 0.0597183 0.0136765 0.0817703 0.019057 0.0915994 -0.0129764 0.0117673 -0.0227938 -0.1640183 -0.091243 -0.1274569 0.0082809 -0.1670487 -0.0448125 0.0346559 0.0288719 0.0491724 0.0772701 unknown
polarizability: 109.4593064|-3.6574782|94.0902193|-4.6309844|-0.5361161|76.4110981 unknown
InChI: InChI=1S/C8H15NO/c1-2-4-7-5-3-6-8(10)9-7/h7,9H,2-6H2,1H3
charge 0 multiplicity 1
25 atoms
O  2.110915 -2.130181 0.09953
N  0.425272 -0.673945 0.72402
C  -0.314978 0.613031 0.77216
C  0.646572 1.779347 0.439086
C  -1.566667 0.593666 -0.149557
C  1.505745 1.462192 -0.803659
C  2.385278 0.223896 -0.528801
C  -2.587398 -0.515426 0.193838
C  1.636122 -0.951419 0.104706
C  -3.858968 -0.437903 -0.678494
H  -0.676495 0.742086 1.814616
H  1.315646 1.964416 1.302373
H  0.050172 2.697243 0.283392
H  -1.248119 0.48524 -1.205244
H  -2.066107 1.580805 -0.062155
H  2.14333 2.328027 -1.061547
H  0.853994 1.276232 -1.678784
H  3.208394 0.486722 0.165548
H  2.865826 -0.157671 -1.446258
H  -0.026049 -1.495228 1.137856
H  -2.868534 -0.437373 1.264978
H  -2.117208 -1.509882 0.058305
H  -4.373456 0.532594 -0.546685
H  -3.609328 -0.543072 -1.750856
H  -4.574955 -1.2386 -0.418567
