program: Gaussian 09
title: 000277956
version: EM64L-G09RevD.01
frameworkgroup: C1[X(C16H18)]
method: RPBEPBE
basis: SDD
operation: Freq
keyword: #p
keyword: freq=noraman
keyword: PBEPBE/SDD
title: #p freq=noraman PBEPBE/SDD
converged: YES YES NO NO
title: Mulliken charges:
elementType: C C C C C C C C C C C C C C C C H H H H H H H H H H H H H H H H H H
charge: 0.212146 -0.699552 0.343515 0.326008 0.481410 -0.623996 -0.626284 0.454219 -0.849251 -0.857805 -0.817041 -0.386251 -0.421105 -0.234022 -0.226778 -0.248933 0.220047 0.246584 0.233967 0.233943 0.228773 0.222993 0.249745 0.232533 0.231818 0.240962 0.223287 0.222711 0.232720 0.251056 0.228805 0.223487 0.223702 0.226586
chargesum: 0.00000
title: Mulliken charges with hydrogens summed into heavy atoms:
elementType: C C C C C C C C C C C C C C C C
charge: 0.212146 -0.232921 0.343515 0.326008 0.481410 -0.390029 -0.392340 0.454219 -0.147740 -0.152492 -0.138323 -0.135195 -0.192300 -0.010535 -0.003076 -0.022347
polarizability: 2.18708563e+02 1.00694392e+01 1.46990034e+02 1.31921251e+01 5.15163344e+00 1.37476912e+02
1716.lowfreq: -27.3327 -4.0314 -0.0008 -0.0005 -0.0003 9.0005 13.4373 23.5553 42.2865
frequency: -27.2684 23.5322 42.1778 48.5078 119.2779 155.1881 177.5529 186.6429 192.0292 230.8053 244.7639 267.0463 310.2153 341.4223 360.8156 404.3759 454.2733 490.0478 499.7188 525.1704 531.9554 539.6028 564.2969 606.1985 616.3613 703.0612 721.4258 736.6779 796.2352 806.0224 856.8021 866.5652 873.1367 895.5842 916.1360 957.2580 969.1445 979.2212 989.7009 996.2485 1016.5264 1017.0788 1026.9440 1041.5199 1044.6050 1045.1519 1050.0109 1081.2969 1147.7723 1170.7273 1186.4339 1189.7651 1197.4564 1219.1427 1263.8957 1280.2843 1316.4040 1334.4221 1369.1455 1381.8432 1394.6165 1399.8451 1401.4071 1415.5037 1437.7364 1444.4342 1469.7653 1471.8402 1472.9966 1474.7279 1478.0895 1483.3170 1485.7625 1500.9902 1589.8864 1592.4590 1612.3826 1621.3171 2969.0008 2971.0878 2972.1882 2985.5483 3028.3815 3045.7363 3046.9812 3052.6384 3080.6485 3081.1141 3082.0428 3109.0576 3110.6498 3113.4904 3121.3284 3133.8681 3144.0349 3161.0299
redmass: 1.0140 3.6574 3.8004 4.0552 3.5955 1.1522 2.1172 2.0200 1.5731 2.5452 4.1076 2.4932 2.8110 3.8674 2.3145 2.8423 2.6650 2.8310 4.8004 3.1711 3.9204 3.9974 4.1754 3.6812 6.1406 2.4243 2.7931 1.5177 3.8829 3.9215 1.2492 1.3631 1.8640 1.3121 1.5693 3.5073 1.6124 1.3917 5.7889 1.3288 1.6504 1.5851 2.2376 1.5428 1.5598 1.8470 1.6068 1.6112 2.8277 1.0573 1.3006 1.4506 1.5285 1.6697 1.3658 1.5923 6.3540 1.3172 5.3511 6.9716 1.2299 1.2935 1.2516 2.4878 2.0245 1.5341 1.3171 1.0718 1.0566 1.0904 1.2745 1.3762 1.4631 1.3471 6.7064 6.1838 5.9893 6.0114 1.0385 1.0382 1.0384 1.0596 1.0994 1.0956 1.0966 1.0951 1.0983 1.0996 1.0987 1.0908 1.0871 1.0917 1.0858 1.0913 1.0957 1.1014
irintensity: 0.4516 0.0092 0.0071 0.1074 0.2407 1.5906 2.4688 2.3038 2.3255 0.0292 0.7719 0.9469 0.3675 1.8041 1.0526 0.0584 6.6260 1.1403 2.1626 0.0210 0.8629 1.0115 0.1287 7.1536 0.5765 20.5468 18.9714 58.6741 1.4222 2.8827 0.0523 20.1002 3.6274 0.0351 0.5283 0.3534 7.3157 0.2374 0.3518 0.3548 11.6013 4.6386 11.6834 4.8884 0.7625 1.1161 25.9127 7.6356 2.3501 0.1013 0.4115 1.8054 0.8645 2.6307 0.2277 0.8995 0.1376 0.7491 0.8484 1.1017 10.6329 14.6510 6.3035 1.2565 4.2193 5.5876 11.1965 26.1964 12.7818 5.4884 1.0947 31.1800 31.6904 18.0531 6.5202 5.6358 12.5403 21.5942 37.2515 42.2715 27.3046 25.6845 12.9560 13.7972 19.1654 25.6372 14.6759 23.8309 25.1585 33.3327 9.3662 18.4327 0.2584 15.5985 40.6038 28.0670
temp: 298.150 k
press: 1.00000 atm
elementType: 6 6 6 6 6 6 6 6 6 6 6 6 6 6 6 6 1 1 1 1 1 1 1 1 1 1 1 1 1 1 1 1 1 1
symmnumber: 1
zpe: 755630.3 jmol-1
zpe.correction: 0.287804 hartree
zpe.thermalcorrener: 0.302496 hartree
zpe.thermalcorrenthalpy: 0.303440 hartree
zpe.thermalcorrgfe: 0.245293 hartree
zpe.sumelectzpe: -619.364715 hartree
zpe.sumelectthermal: -619.350023 hartree
zpe.sumelectthermalent: -619.349079 hartree
zpe.sumelectthermalfe: -619.407226 hartree
dipole: 0.1122 0.0183 -0.1469
dipole: 0.1857
quadrupole: -90.0176 -93.2047 -92.7140
quadrupole: 2.2245 3.0968 1.4131
quadrupole: 1.9612 -1.2259 -0.7352 2.2245 3.0968 1.4131
hfenergy: -619.6525192 hartree
pointgroup: C01 [X(C16H18)]
dipole: 0.0455301 -0.0070877 0.0567125 debye
polarizability: 218.2610292|-9.0946131|146.720053|-15.1637556|5.2765401|138.1944274 unknown
InChI: InChI=1S/C16H18/c1-12-9-13(2)16(14(3)10-12)11-15-7-5-4-6-8-15/h4-10H,11H2,1-3H3
charge 0 multiplicity 1
34 atoms
C  0.761465 -0.047941 0.736114
C  -0.594827 -0.18286 1.420251
C  1.24156 1.242809 0.357813
C  1.557631 -1.198809 0.457148
C  3.30073 0.229826 -0.56682
C  2.49828 1.360673 -0.282363
C  2.811095 -1.041224 -0.18505
C  -1.812316 -0.123884 0.485222
C  0.424874 2.494009 0.63762
C  1.093543 -2.598784 0.83616
C  4.633685 0.374764 -1.282056
C  -1.73927 -0.557907 -0.862761
C  -3.061425 0.33362 0.98019
C  -2.885327 -0.54312 -1.690427
C  -4.20912 0.349911 0.156405
C  -4.125897 -0.091514 -1.184745
H  -0.710308 0.607422 2.186938
H  -0.636242 -1.141024 1.972416
H  2.858864 2.3583 -0.564895
H  3.417503 -1.932699 -0.391476
H  0.924539 3.390424 0.232652
H  0.280651 2.654323 1.724223
H  -0.582713 2.431542 0.186269
H  1.791839 -3.35994 0.448184
H  1.03772 -2.731489 1.934132
H  0.089811 -2.825911 0.430659
H  5.122796 1.334039 -1.035759
H  5.327861 -0.441363 -1.014202
H  4.502469 0.346998 -2.381647
H  -0.777296 -0.891101 -1.268698
H  -3.133935 0.680572 2.019175
H  -2.808715 -0.881091 -2.730465
H  -5.163865 0.709445 0.557478
H  -5.013664 -0.078117 -1.827085
