program: Gaussian 09
title: 000277943
version: EM64L-G09RevD.01
frameworkgroup: C1[X(C6H13NO3)]
method: RPBEPBE
basis: SDD
operation: Freq
keyword: #p
keyword: freq=noraman
keyword: PBEPBE/SDD
title: #p freq=noraman PBEPBE/SDD
converged: YES YES NO NO
title: Mulliken charges:
elementType: O O O N C C C C C C H H H H H H H H H H H H H
charge: -0.440142 -0.208600 -0.215464 0.130274 -0.366908 -0.413891 -0.058012 -0.049800 -0.691344 -0.713766 0.255568 0.203045 0.217486 0.201109 0.241338 0.212906 0.234716 0.219940 0.247137 0.206537 0.215205 0.243150 0.329516
chargesum: 0.00000
title: Mulliken charges with hydrogens summed into heavy atoms:
elementType: O O O N C C C C C C
charge: -0.110626 -0.208600 -0.215464 0.130274 0.091705 0.004704 0.183326 0.163106 0.010449 -0.048875
polarizability: 8.58923452e+01 1.53519646e+00 8.20869756e+01 7.28032419e-01 3.02976666e+00 8.03211367e+01
1716.lowfreq: -12.4218 -5.0380 -0.0007 -0.0003 0.0002 2.2849 24.0545 36.1884 56.8489
frequency: 23.9640 35.9715 56.7195 109.5306 135.8650 198.7936 208.2750 223.7629 267.9489 281.9266 309.8518 321.0065 394.8373 450.0636 474.8413 523.6588 593.0933 677.2581 766.5412 783.8271 818.1032 905.2537 911.7160 936.7765 995.9499 1036.8407 1054.4405 1066.5725 1115.3557 1127.5965 1139.4279 1175.0795 1227.1388 1256.2841 1262.6645 1279.9214 1308.4756 1311.3885 1334.6738 1364.1562 1372.1432 1386.9699 1389.7037 1429.0771 1449.3031 1459.5473 1468.0140 1469.1913 1471.5467 1479.7524 2965.8669 2974.0922 2993.9710 2998.1891 3015.7579 3032.7505 3050.3900 3068.1139 3073.8082 3093.3882 3097.0210 3110.2933 3539.2234
redmass: 11.4211 3.9941 4.2897 3.6398 2.2185 1.1361 1.6688 1.3892 2.7485 3.6287 1.7765 1.5788 2.9277 3.9853 2.3350 3.5697 2.7747 5.2629 2.3963 3.0006 2.3815 1.8624 2.0272 1.4224 1.5963 1.9691 2.4290 1.6149 1.9512 2.0415 2.2775 1.8063 3.2661 1.4208 1.5549 1.5759 1.2649 1.2732 1.4718 1.3779 1.2614 1.2240 1.2410 2.8905 1.1587 1.0851 1.0643 1.0604 1.0505 1.0528 1.0589 1.0392 1.0607 1.0375 1.0917 1.0927 1.0891 1.0975 1.0985 1.0992 1.1001 1.1004 1.0658
irintensity: 0.2384 3.7494 2.1631 6.8068 0.6199 0.2510 0.7710 1.0413 1.9693 1.9417 22.4963 142.1656 1.9236 18.4250 3.6784 6.0038 1.4377 0.3611 19.2053 6.9617 15.4259 2.6141 7.8052 2.1973 42.3784 16.0059 11.6440 10.8308 21.3793 19.2014 38.7947 13.5898 24.6853 5.7020 14.8297 55.0569 2.7617 0.2503 10.1437 9.3033 19.0745 36.9940 15.1117 93.8270 8.9996 4.7661 4.4802 22.3264 12.8431 14.6556 7.8391 25.3798 12.5962 23.8912 8.1055 21.4955 1.9891 29.9014 46.6752 28.4483 21.8191 16.5400 4.7399
temp: 298.150 k
press: 1.00000 atm
elementType: 8 8 8 7 6 6 6 6 6 6 1 1 1 1 1 1 1 1 1 1 1 1 1
symmnumber: 1
zpe: 501556.3 jmol-1
zpe.correction: 0.191033 hartree
zpe.thermalcorrener: 0.203251 hartree
zpe.thermalcorrenthalpy: 0.204195 hartree
zpe.thermalcorrgfe: 0.151225 hartree
zpe.sumelectzpe: -515.949099 hartree
zpe.sumelectthermal: -515.936881 hartree
zpe.sumelectthermalent: -515.935936 hartree
zpe.sumelectthermalfe: -515.988907 hartree
dipole: -1.0201 1.8038 -2.6950
dipole: 3.3996
quadrupole: -62.7295 -65.2622 -62.9342
quadrupole: 11.8476 -0.1976 -4.3065
quadrupole: 0.9125 -1.6203 0.7078 11.8476 -0.1976 -4.3065
hfenergy: -516.1401319 hartree
pointgroup: C01 [X(C6H13N1O3)]
dipole: 0.3757509 0.6212411 1.1232958 debye
dipolederiv: -0.7442787 0.0855849 0.0798272 0.0786934 -0.198644 0.1819847 0.0792357 0.2133797 -0.7059847 -0.225602 -0.1219891 0.0438923 -0.1292218 -0.6865113 0.2374053 -0.022119 0.0393717 -0.5201742 -0.2425206 -0.0521918 -0.0355804 -0.0865718 -0.4864 -0.0562611 -0.0103716 0.1680977 -0.7305621 0.0552326 0.2265166 0.005007 0.2927843 0.9357395 -0.1412665 0.074107 -0.1683178 1.0171365 0.0275142 0.0845072 0.04001 -0.0050516 0.0414195 0.0390143 0.0536256 -0.0208588 0.0408462 -0.2066299 0.00112 0.0644537 -0.0402797 0.0327801 0.0619273 0.0175641 0.0375466 0.0950062 0.2218916 -0.0437792 -0.0183292 -0.0197316 0.1003762 -0.029576 -0.0317247 0.0240243 0.1571565 0.5598795 -0.0333637 -0.0324827 0.0236006 0.2937329 -0.0799976 -0.052965 -0.0936427 0.6249477 -0.0575591 0.0283805 -0.0409913 0.025165 -0.0038596 0.0102355 -0.0510708 -0.0450981 0.0059989 -0.1563087 0.1239293 -0.0437546 0.0881448 -0.0241006 0.0934757 0.010624 0.0531133 -0.0030672 0.0930038 0.0019548 -0.0302549 0.0117228 0.0714637 0.0285316 -0.026417 0.0704077 -0.0391985 0.0337247 -0.0567582 -0.0369079 -0.0050224 -0.0759492 -0.1014254 -0.0080742 -0.108068 0.0235735 0.0527743 -0.021044 -0.0027631 -0.0126522 -0.0841193 -0.0819293 -0.025242 -0.104781 -0.0015975 0.0517925 -0.0047573 0.0352664 0.021599 0.0487603 0.0548357 0.0060679 0.0759112 -0.1468835 0.0534128 0.0005071 -0.0076357 -0.0283444 -0.0157315 0.066939 0.0008324 0.0185995 -0.0620741 0.0406542 -0.003173 -0.0006154 -0.0386261 -0.11578 -0.0866626 -0.0066891 -0.0626607 -0.0342537 -0.1440577 -0.0111521 0.0353386 -0.0621272 0.0584697 0.0277043 0.0379896 0.0273652 0.0953218 0.0921698 -0.0352217 -0.0447191 -0.0239078 -0.0521103 -0.1053341 -0.0341584 -0.1022349 0.0313354 0.0922535 -0.0054217 0.0476703 0.0185752 0.0936235 0.0218072 0.001366 0.0829885 -0.0588183 0.0677049 -0.071832 -0.0614463 -0.009965 -0.0898377 -0.0822404 -0.0281664 -0.1202386 0.0190193 0.1016823 0.0105194 0.0161726 0.0183772 0.0756725 0.0423149 -0.0201348 0.0596812 -0.156274 -0.1529887 -0.0287712 0.0409333 -0.0535294 0.0637835 0.0215475 0.0701278 0.0146313 0.0914479 0.3862547 -0.0735649 -0.0530909 -0.0636314 0.0172218 -0.1230301 -0.0344072 -0.0592174 0.257098 unknown
polarizability: 85.8059381|-1.5439181|82.5818316|0.7514737|-2.9182043|79.9126878 unknown
InChI: InChI=1S/C6H13NO3/c1-5(7(9)10)3-4-6(2)8/h5-6,8H,3-4H2,1-2H3
charge 0 multiplicity 1
23 atoms
O  2.614262 0.738042 -1.18979
O  -1.979652 -1.800449 0.266404
O  -1.753961 -0.49355 -1.587935
N  -1.747799 -0.674877 -0.314511
C  0.042246 0.968235 0.299241
C  1.090908 -0.128016 0.580238
C  -1.414893 0.539943 0.580015
C  2.52437 0.335985 0.2329
C  -2.436771 1.65411 0.297668
C  3.586908 -0.721954 0.576196
H  0.130414 1.304163 -0.749991
H  0.246065 1.849822 0.938737
H  0.863876 -1.040978 -0.008794
H  1.056723 -0.42484 1.647898
H  -1.522366 0.140838 1.603633
H  2.746901 1.278874 0.766247
H  -3.468653 1.319352 0.501237
H  -2.219137 2.517596 0.950279
H  -2.369829 1.980034 -0.753785
H  3.37849 -1.676854 0.054842
H  3.606521 -0.93002 1.661991
H  4.587299 -0.370468 0.270582
H  2.481877 -0.069191 -1.751699
