program: Gaussian 09
title: 000277955
version: EM64L-G09RevD.01
frameworkgroup: C1[X(C17H20)]
method: RPBEPBE
basis: SDD
operation: Freq
keyword: #p
keyword: freq=noraman
keyword: PBEPBE/SDD
title: #p freq=noraman PBEPBE/SDD
converged: YES YES NO NO
title: Mulliken charges:
elementType: C C C C C C C C C C C C C C C C C H H H H H H H H H H H H H H H H H H H H
charge: 0.257659 0.131356 0.122374 -0.718450 0.366031 0.367927 -0.714823 0.430380 -0.870352 -0.874552 -0.854559 -0.853708 -0.379254 -0.399115 -0.242548 -0.231032 -0.246930 0.232392 0.250309 0.229821 0.231890 0.245371 0.252779 0.247272 0.235560 0.248976 0.228722 0.228964 0.231403 0.232359 0.229294 0.227144 0.255119 0.228987 0.223327 0.223503 0.226402
chargesum: 0.00000
title: Mulliken charges with hydrogens summed into heavy atoms:
elementType: C C C C C C C C C C C C C C C C C
charge: 0.257659 0.131356 0.122374 -0.235748 0.366031 0.367927 -0.485003 0.430380 -0.140312 -0.142743 -0.165470 -0.164911 -0.124134 -0.170127 -0.019221 -0.007529 -0.020528
polarizability: 2.24132125e+02 6.92710724e+00 1.69410663e+02 -1.31703280e+01 -3.92652484e+00 1.45600432e+02
1716.lowfreq: -6.0921 -0.0003 0.0005 0.0006 4.5696 6.8887 13.5097 38.6738 51.5703
frequency: 10.2245 38.5510 51.5623 104.8361 113.0017 127.2480 146.2494 172.1408 180.8818 189.2485 206.0491 243.2023 299.3726 315.4038 325.2652 349.3489 355.3340 385.1648 403.3050 439.0772 457.4483 492.7502 507.3455 542.4445 575.3045 587.5724 617.6858 654.9010 682.9221 702.2285 731.4379 755.8873 792.9168 803.2351 855.2021 878.8115 900.0829 904.0343 957.0385 978.3861 989.5817 994.8592 995.7218 1018.1747 1022.4362 1025.5809 1027.7746 1047.2082 1051.5004 1053.1506 1073.2910 1080.4556 1086.7108 1170.5770 1187.1766 1190.3286 1198.4873 1221.6254 1248.9584 1272.0055 1313.7394 1334.1447 1361.2472 1382.1456 1393.0915 1393.9509 1400.7052 1401.5067 1406.5701 1437.9830 1450.8243 1455.3296 1465.8295 1467.4855 1476.7613 1483.1037 1484.1030 1488.6060 1490.5283 1494.7429 1503.5083 1585.7167 1591.5182 1612.5082 1613.0439 2967.9436 2969.2250 2969.7434 2970.3405 2987.8893 3028.6074 3044.4244 3044.9839 3046.5448 3047.1779 3077.4315 3078.3814 3098.7664 3099.9066 3109.3246 3110.2172 3121.3755 3133.7559 3144.0510 3160.6198
redmass: 3.6696 3.8051 3.7633 2.1612 1.5304 1.2678 1.3858 2.6829 2.3659 1.0664 1.3900 3.8692 2.9502 3.2283 2.3654 2.6554 3.2893 2.3828 2.8355 4.5321 2.6412 4.4585 4.5244 2.4762 4.4948 3.2801 6.1784 3.9767 4.2761 2.4100 1.3757 4.0071 2.6630 3.9300 1.2505 1.3242 1.3995 2.2619 1.6937 1.3823 6.0383 1.3202 1.3300 1.5504 1.4171 1.7214 1.8236 2.1393 1.7155 1.6839 1.9155 2.4738 1.7864 1.0535 1.2918 1.7714 1.3367 4.3092 1.3635 1.6421 4.5123 1.4540 5.2680 7.0859 1.3128 1.2501 1.2236 1.4024 2.5224 2.2111 1.1231 1.6775 1.0551 1.0576 1.3744 1.0979 1.5961 1.2117 1.3947 1.0568 1.0910 5.9898 6.0295 6.3669 6.1882 1.0433 1.0379 1.0411 1.0393 1.0598 1.0990 1.0969 1.0969 1.0937 1.0925 1.0982 1.0981 1.0952 1.0959 1.0871 1.0909 1.0858 1.0914 1.0955 1.1014
irintensity: 0.0088 0.0074 0.0759 0.0150 0.3251 0.4890 1.4943 2.8475 2.4736 0.1670 0.8722 1.1662 1.4469 2.2759 2.1332 1.0912 0.0232 0.1608 0.0817 0.1196 7.7115 2.5043 2.9980 0.5378 0.6236 0.0776 0.4085 0.8346 3.3666 22.2169 63.4490 0.6302 7.5200 1.2798 0.0587 8.7103 1.1208 4.3112 7.0196 0.0733 0.4582 0.3746 4.2533 13.6131 3.8247 23.0674 3.7386 3.1998 0.6499 2.3954 10.2291 0.5497 13.8678 0.0766 0.5551 3.0109 1.4430 2.0426 0.2088 1.4597 0.3047 0.6076 0.0080 1.2624 7.5379 1.3683 28.7263 2.2025 1.4039 5.6529 2.9666 0.6032 2.7156 49.5459 9.3847 4.0516 39.9713 14.1864 24.2279 3.5432 5.5267 1.7286 0.8594 9.0928 11.0710 40.7767 42.5599 60.4299 2.8731 22.2007 11.4454 15.7777 42.3194 10.7501 7.3286 18.5987 29.0869 20.6160 16.4064 9.3704 33.8618 0.1010 17.2400 37.2896 29.2264
temp: 298.150 k
press: 1.00000 atm
elementType: 6 6 6 6 6 6 6 6 6 6 6 6 6 6 6 6 6 1 1 1 1 1 1 1 1 1 1 1 1 1 1 1 1 1 1 1 1
symmnumber: 1
zpe: 828342.8 jmol-1
zpe.correction: 0.315499 hartree
zpe.thermalcorrener: 0.332472 hartree
zpe.thermalcorrenthalpy: 0.333416 hartree
zpe.thermalcorrgfe: 0.269775 hartree
zpe.sumelectzpe: -658.588211 hartree
zpe.sumelectthermal: -658.571238 hartree
zpe.sumelectthermalent: -658.570294 hartree
zpe.sumelectthermalfe: -658.633935 hartree
dipole: -0.1270 -0.0109 -0.2709
dipole: 0.2994
quadrupole: -97.1362 -99.2877 -98.8151
quadrupole: 1.4949 -2.7577 -1.1032
quadrupole: 1.2768 -0.8748 -0.4021 1.4949 -2.7577 -1.1032
hfenergy: -658.9037097 hartree
pointgroup: C01 [X(C17H20)]
dipole: 0.0525334 -0.0007031 0.1054082 debye
polarizability: 224.0636062|-4.0063185|168.8800918|-15.1270257|3.1102755|146.1995221 unknown
InChI: InChI=1S/C17H20/c1-12-10-13(2)15(4)17(14(12)3)11-16-8-6-5-7-9-16/h5-10H,11H2,1-4H3
charge 0 multiplicity 1
37 atoms
C  0.661964 0.016065 0.692668
C  1.105357 1.321992 0.322023
C  1.448752 -1.138872 0.399871
C  -0.674558 -0.139045 1.412858
C  2.362461 1.474877 -0.330536
C  2.708032 -0.981034 -0.250003
C  3.13678 0.321303 -0.596363
C  -1.917763 -0.19235 0.511175
C  0.237702 2.534258 0.631445
C  0.946306 -2.526636 0.780692
C  2.898463 2.837948 -0.743164
C  3.60277 -2.167416 -0.578706
C  -1.834397 -0.494056 -0.871327
C  -3.201124 0.031928 1.076616
C  -3.001665 -0.575071 -1.666091
C  -4.36903 -0.049152 0.286894
C  -4.273811 -0.355227 -1.091393
H  -0.809344 0.689478 2.134052
H  -0.660506 -1.060555 2.02521
H  4.107658 0.442016 -1.094062
H  0.234701 2.765129 1.71588
H  0.591771 3.436197 0.108289
H  -0.812811 2.365351 0.333848
H  1.53522 -3.320299 0.294807
H  1.009092 -2.698814 1.873879
H  -0.109502 -2.672762 0.488479
H  2.244961 3.331276 -1.488339
H  2.983868 3.527047 0.118262
H  3.900915 2.742271 -1.194435
H  4.548571 -1.827359 -1.034255
H  3.858667 -2.755797 0.322647
H  3.122686 -2.863483 -1.293554
H  -0.85069 -0.652954 -1.327536
H  -3.283646 0.272541 2.144649
H  -2.916194 -0.808226 -2.733863
H  -5.34977 0.129183 0.743027
H  -5.177984 -0.41675 -1.707544
