program: Gaussian 09
title: 000277980
version: EM64L-G09RevD.01
frameworkgroup: C1[X(C17H18N6O2)]
method: RPBEPBE
basis: SDD
operation: Freq
keyword: #p
keyword: freq=noraman
keyword: PBEPBE/SDD
title: #p freq=noraman PBEPBE/SDD
converged: YES YES NO NO
title: Mulliken charges:
elementType: O O N N N N N N C C C C C C C C C C C C C C C C C H H H H H H H H H H H H H H H H H H
charge: -0.209903 -0.211592 -0.183140 -0.085368 -0.045726 -0.378328 -0.085479 0.027171 -0.027194 -0.469031 -0.467680 -0.421614 -0.423569 0.140098 -0.238344 -0.149962 0.225392 -0.380025 -0.533142 0.527967 -0.340536 -0.425962 -0.362216 -0.353931 0.377593 0.202459 0.228476 0.259054 0.258813 0.228813 0.220834 0.215784 0.215326 0.220414 0.269039 0.331569 0.244522 0.235219 0.284302 0.262705 0.244818 0.286200 0.286170
chargesum: 0.00000
title: Mulliken charges with hydrogens summed into heavy atoms:
elementType: O O N N N N N N C C C C C C C C C C C C C C C C C
charge: -0.209903 -0.211592 -0.183140 -0.085368 -0.045726 -0.046758 -0.085479 0.027171 0.175265 0.018499 0.019945 0.015004 0.012171 0.140098 0.030695 -0.149962 0.225392 -0.135503 -0.013620 0.527967 -0.077831 -0.181144 -0.076015 -0.067761 0.377593
polarizability: 3.86349118e+02 9.29477253e+00 1.96697524e+02 -7.22324322e+00 1.70301608e+00 1.72027718e+02
1716.lowfreq: -36.4144 -2.0383 -0.0011 -0.0007 0.0004 4.1356 7.3537 15.5556 21.3089
frequency: -36.3444 15.2717 21.2393 24.1377 43.4975 64.1826 68.6730 72.9445 96.8039 126.6800 156.2724 169.6648 196.2647 217.0202 222.1721 258.0507 284.7316 299.4542 337.0393 387.5773 387.9696 409.3576 420.5636 455.1001 489.3401 504.1690 535.1290 562.0184 575.5607 608.4062 619.1621 624.2651 630.5862 642.7271 658.7550 669.6808 673.8924 720.8717 731.9797 753.9430 767.8726 791.6805 801.6809 813.2070 818.9211 823.7715 851.1796 853.2328 857.5353 881.3938 906.7654 925.9039 958.6191 961.3638 974.8018 979.2522 982.0892 996.0200 1001.3590 1007.4756 1065.8286 1087.8878 1093.5033 1101.7023 1113.9240 1125.9595 1139.9888 1175.9144 1179.7174 1194.3102 1200.5363 1211.1734 1221.7325 1221.9904 1230.1881 1248.3668 1260.0263 1273.4811 1296.9937 1299.5887 1302.9213 1303.7037 1305.8644 1313.1544 1323.1069 1338.2182 1361.2236 1366.1232 1372.5081 1387.4575 1405.3379 1422.2265 1431.2533 1441.7786 1460.8488 1466.5015 1474.9299 1478.3372 1482.3459 1489.5402 1494.6701 1538.6107 1596.9704 1609.7804 1611.5901 2976.6928 2996.1252 2998.7050 3010.3171 3013.3242 3022.2821 3030.7318 3052.7792 3072.7621 3081.2784 3093.7848 3134.2665 3154.7121 3162.3896 3182.2278 3184.6527 3227.6481 3546.8491
redmass: 1.6399 6.1785 5.7457 5.3556 5.2186 3.6480 6.6761 4.2239 5.2191 6.2818 4.7102 4.9384 3.6978 4.4457 7.1070 5.0735 4.7934 4.7723 4.9777 5.8603 5.1414 2.9105 3.2086 2.6643 4.5020 7.6565 4.6789 3.5746 3.7864 1.9516 3.0545 4.0447 2.8723 4.7159 6.7542 5.6351 5.3733 5.3035 4.4638 1.4984 6.4474 4.5901 3.2586 1.5009 4.8064 1.7368 1.5528 1.7738 2.7494 3.2561 2.6520 1.4292 3.7057 1.7918 1.4181 1.5153 1.5739 1.4310 2.0486 2.5660 2.8267 4.3387 3.1987 3.6140 1.3711 3.2292 2.2568 1.5166 1.3158 1.6148 1.8070 2.8526 3.8141 2.1395 1.1619 1.3442 2.2458 1.2999 1.3393 1.4465 3.0118 1.2154 1.4627 3.4888 1.7526 1.7321 2.5878 5.4657 2.4051 1.5953 6.8758 2.9573 2.5836 2.3351 1.1793 1.0785 1.0849 1.0847 2.2688 3.3036 1.1257 7.0950 7.6968 6.0582 5.8383 1.0594 1.0850 1.0612 1.0598 1.0608 1.0656 1.1013 1.1009 1.1030 1.1057 1.1052 1.0907 1.0898 1.0919 1.0944 1.0957 1.0982 1.0775
irintensity: 0.0144 0.3193 1.1359 0.0168 1.1146 0.5703 0.2532 1.7449 1.9666 2.4775 1.2380 3.2068 0.2775 2.2495 1.3467 0.1429 1.6382 3.1909 0.4352 11.9468 3.0482 0.7626 1.0639 5.7842 13.7075 0.5279 15.1942 5.6464 5.4414 76.6931 3.5379 11.8334 20.5484 33.1791 4.8459 16.4966 12.3968 3.7210 9.3937 13.3947 32.8694 22.4555 46.9002 0.4357 2.5424 7.2622 24.0530 3.0824 22.0507 9.2307 2.5467 9.4834 24.4864 13.7203 0.0202 1.7286 8.9703 1.9887 0.8839 12.5240 10.6076 40.1633 12.2908 1.3479 9.4480 7.1602 23.1146 0.3207 66.5762 10.1864 40.7117 7.8116 350.9877 91.5116 0.5892 126.4892 5.3055 0.0126 12.4939 13.0368 38.0636 2.1943 0.8861 45.7221 10.1984 35.7070 141.9797 74.2702 24.7006 9.8583 7.9290 105.6810 36.5853 72.0928 20.7016 2.3496 11.4411 4.9099 5.3523 7.9788 11.4219 100.2757 24.4981 234.5504 556.8427 82.3240 21.5128 14.3350 64.3713 48.2803 22.7493 37.4416 12.4400 8.7711 13.1826 61.0030 10.6893 4.8466 17.7747 0.0623 3.4668 0.1122 57.3615
temp: 298.150 k
press: 1.00000 atm
elementType: 8 8 7 7 7 7 7 7 6 6 6 6 6 6 6 6 6 6 6 6 6 6 6 6 6 1 1 1 1 1 1 1 1 1 1 1 1 1 1 1 1 1 1
symmnumber: 1
zpe: 886149.5 jmol-1
zpe.correction: 0.337517 hartree
zpe.thermalcorrener: 0.357880 hartree
zpe.thermalcorrenthalpy: 0.358824 hartree
zpe.thermalcorrgfe: 0.284664 hartree
zpe.sumelectzpe: -1135.707448 hartree
zpe.sumelectthermal: -1135.687085 hartree
zpe.sumelectthermalent: -1135.686141 hartree
zpe.sumelectthermalfe: -1135.760301 hartree
dipole: 7.1676 -2.2500 1.5874
dipole: 7.6783
quadrupole: -170.1570 -144.8037 -146.5549
quadrupole: 29.0416 4.7851 -0.5988
quadrupole: -16.3185 9.0348 7.2837 29.0416 4.7851 -0.5988
hfenergy: -1136.0449645 hartree
pointgroup: C01[X(C17H18N6O2)]
dipole: -2.7606874 0.2979112 -1.1897557 debye
polarizability: 386.8990963|-4.7778556|177.5716145|-2.2642501|10.5777983|190.6036483 unknown
InChI: InChI=1S/C17H18N6O2/c24-23(25)14-7-5-12(6-8-14)9-18-16-15-17(20-10-19-16)22(11-21-15)13-3-1-2-4-13/h5-8,10-11,13,18H,1-4,9H2
charge 0 multiplicity 1
43 atoms
O  6.383236 0.601899 2.835582
O  7.728982 0.143695 1.051465
N  -3.671612 1.003748 -0.30719
N  -1.665868 1.811121 -1.10257
N  -3.013767 -1.383529 0.047602
N  0.750253 -0.067958 -1.413191
N  -0.667538 -1.785229 -0.573875
N  6.566429 0.249186 1.606118
C  -5.088423 1.006967 0.116064
C  -5.312487 0.566974 1.587571
C  -5.992847 0.034648 -0.686626
C  -6.837044 0.26609 1.65264
C  -7.279636 -0.061197 0.179542
C  -2.787998 -0.08324 -0.321181
C  -2.94189 2.103438 -0.784302
C  -1.560249 0.439688 -0.81516
C  -0.47373 -0.475741 -0.939146
C  -1.902262 -2.158216 -0.111096
C  1.880785 -0.978971 -1.617421
C  3.104135 -0.626382 -0.779008
C  2.961427 -0.235312 0.578604
C  4.404664 -0.718567 -1.337571
C  4.089676 0.051468 1.368287
C  5.547384 -0.436242 -0.564353
C  5.371719 -0.053586 0.782958
H  -5.447387 2.046313 -0.020551
H  -4.988989 1.334457 2.312063
H  -4.725346 -0.350598 1.769188
H  -5.485698 -0.944729 -0.744312
H  -6.185237 0.386934 -1.714979
H  -7.393164 1.141434 2.034803
H  -7.044855 -0.571888 2.339899
H  -7.739594 -1.06109 0.099402
H  -8.03514 0.668961 -0.164239
H  -3.393216 3.089492 -0.876182
H  0.839059 0.919105 -1.66462
H  -2.00449 -3.211653 0.16634
H  2.158512 -1.011255 -2.689117
H  1.507787 -1.984293 -1.340745
H  1.958554 -0.158729 1.010912
H  4.524143 -1.012963 -2.386787
H  4.001805 0.34926 2.416367
H  6.557417 -0.500608 -0.977281
