program: Gaussian 09
title: 000277926
version: EM64L-G09RevD.01
frameworkgroup: C1[X(C12H15ClO)]
method: RPBEPBE
basis: SDD
operation: Freq
keyword: #p
keyword: freq=noraman
keyword: PBEPBE/SDD
title: #p freq=noraman PBEPBE/SDD
converged: YES YES NO NO
title: Mulliken charges:
elementType: Cl O C C C C C C C C C C C C H H H H H H H H H H H H H H H
charge: -0.074161 -0.466819 0.210933 -0.519245 -0.469191 -0.382215 -0.392400 -0.393512 0.396697 -0.340973 -0.416458 -0.116748 -0.205402 -0.255568 0.217467 0.194685 0.212099 0.229568 0.209647 0.194941 0.195765 0.226234 0.187987 0.205663 0.331138 0.249107 0.282010 0.231511 0.257241
chargesum: 0.00000
title: Mulliken charges with hydrogens summed into heavy atoms:
elementType: Cl O C C C C C C C C C C C C
charge: -0.074161 -0.135681 0.210933 -0.107093 -0.027524 0.022373 0.029599 0.000137 0.396697 -0.091866 -0.134448 -0.116748 0.026108 0.001673
polarizability: 1.77779960e+02 2.36880070e+00 1.40985693e+02 -2.14477508e+00 8.06237147e-02 9.13406035e+01
1716.lowfreq: -20.4571 -3.6090 -0.0025 -0.0018 -0.0009 9.8181 19.8276 86.7261 101.7812
frequency: -11.4595 86.5318 101.6084 167.7413 183.7145 207.2434 246.9943 276.3865 299.3500 312.8638 332.6179 362.2246 389.9219 394.1720 440.5872 459.6832 481.0340 498.2169 579.3064 630.1983 668.7779 703.0760 728.6751 772.4989 795.6146 822.8862 846.5813 877.9359 905.8860 910.7257 921.6108 929.9941 933.4053 983.2610 992.5719 1008.6934 1049.7515 1054.9940 1072.5641 1092.4742 1097.5390 1118.5148 1147.0636 1167.6206 1173.4774 1203.3209 1252.4171 1260.3767 1272.8438 1285.5278 1305.5102 1334.6791 1338.7315 1343.5677 1347.3965 1360.3918 1372.7223 1408.5700 1447.2471 1454.5507 1455.4654 1460.7920 1466.6252 1474.3362 1570.5516 1603.6608 2961.7806 2969.4821 2986.1069 2989.4927 2993.6386 3027.1617 3030.8343 3046.0725 3050.9880 3062.2528 3137.8696 3162.0547 3165.5118 3176.1158 3540.4778
redmass: 4.2654 3.8724 4.1965 4.1568 4.9068 2.3481 3.3490 4.3873 3.6131 2.4165 1.4750 2.1294 4.0886 2.4971 3.0642 3.2080 2.4144 2.5887 4.8717 4.3552 4.3842 2.3474 6.5737 1.4977 1.3962 2.5285 1.9233 1.5908 2.1445 2.0844 1.4157 1.6277 2.3542 5.2100 1.3587 3.0660 1.7314 1.7105 1.9724 1.5138 1.4478 1.6190 2.2053 1.4149 1.0849 2.9249 1.3921 1.3706 1.3306 1.2920 1.3573 1.6019 1.3829 1.4730 1.4263 1.4833 6.8380 2.9173 1.0945 1.1703 1.1037 1.9725 1.0833 1.0970 6.5941 6.9479 1.0637 1.0598 1.0608 1.0612 1.0634 1.1003 1.0955 1.1006 1.1027 1.1024 1.0874 1.0926 1.0916 1.0979 1.0657
irintensity: 0.9355 0.1842 0.5177 1.9522 0.6203 1.6994 0.7501 0.3620 1.8044 5.7261 111.3378 45.6112 5.3370 3.1872 8.5589 1.7815 8.4063 9.2302 0.4818 3.1669 13.9382 25.3604 42.0368 2.5865 50.1210 7.9397 5.2474 19.4327 9.7066 4.6714 8.1158 5.9632 29.1635 7.9727 1.8332 26.2084 11.4988 2.6602 11.2172 0.6841 10.4814 16.0628 2.7262 2.3177 1.4580 48.2223 10.4491 6.2154 6.0884 0.1198 15.0263 8.3008 0.9930 3.8233 6.3978 5.5864 1.9486 21.8917 6.4544 1.1942 9.8189 40.4616 12.3891 5.8356 45.2982 27.8378 37.6786 30.0949 35.1122 44.3544 29.9915 31.7769 68.9566 22.1171 19.4416 70.6704 8.8940 4.8859 1.6846 7.7026 5.9904
temp: 298.150 k
press: 1.00000 atm
elementType: 17 8 6 6 6 6 6 6 6 6 6 6 6 6 1 1 1 1 1 1 1 1 1 1 1 1 1 1 1
symmnumber: 1
zpe: 631303.6 jmol-1
zpe.correction: 0.240451 hartree
zpe.thermalcorrener: 0.252430 hartree
zpe.thermalcorrenthalpy: 0.253374 hartree
zpe.thermalcorrgfe: 0.202829 hartree
zpe.sumelectzpe: -1000.511832 hartree
zpe.sumelectthermal: -1000.499853 hartree
zpe.sumelectthermalent: -1000.498909 hartree
zpe.sumelectthermalfe: -1000.549454 hartree
dipole: 1.0424 0.5649 -0.7700
dipole: 1.4137
quadrupole: -94.9500 -88.6304 -89.6719
quadrupole: -9.1848 -0.7279 -1.0623
quadrupole: -3.8659 2.4537 1.4122 -9.1848 -0.7279 -1.0623
hfenergy: -1000.7522831 hartree
pointgroup: C01 [X(C12H15Cl1O1)]
dipole: -0.3825922 0.3528646 0.1960684 debye
polarizability: 176.542992|-6.9558716|137.4572223|1.7895577|-14.9124196|96.1060421 unknown
InChI: InChI=1S/C12H15ClO/c13-11-6-4-5-10(9-11)12(14)7-2-1-3-8-12/h4-6,9,14H,1-3,7-8H2
charge 0 multiplicity 1
29 atoms
Cl 3.665194 -2.245515 0.726939
O  -1.475476 1.767321 0.318778
C  -0.988431 0.373769 0.126454
C  -1.577192 -0.524551 1.249157
C  -1.5496 -0.043944 -1.260281
C  -3.123416 -0.540058 1.223519
C  -3.09455 -0.088772 -1.280065
C  -3.650464 -0.995505 -0.157315
C  0.552671 0.374212 0.089725
C  1.309284 -0.78451 0.406276
C  1.241295 1.544925 -0.323763
C  2.711956 -0.740433 0.309938
C  2.650155 1.562832 -0.411874
C  3.409115 0.413176 -0.092936
H  -1.20322 -0.176085 2.233543
H  -1.213904 -1.562581 1.119655
H  -1.134259 -1.040001 -1.510633
H  -1.170829 0.667808 -2.016971
H  -3.504222 0.477058 1.437969
H  -3.498189 -1.208449 2.022522
H  -3.438394 -0.444375 -2.27067
H  -3.481296 0.93852 -1.144739
H  -3.341865 -2.046453 -0.340955
H  -4.757194 -0.979897 -0.166905
H  -1.177908 2.078399 1.212752
H  0.823514 -1.711897 0.721841
H  0.656859 2.434806 -0.576796
H  3.167422 2.473746 -0.732622
H  4.500844 0.414554 -0.156547
