program: Gaussian 09
title: 000277927
version: EM64L-G09RevD.01
frameworkgroup: C1[X(C12H14O4)]
method: RPBEPBE
basis: SDD
operation: Freq
keyword: #pfreq=noraman
keyword: PBEPBE/SDD
title: #p freq=noraman PBEPBE/SDD
converged: YES YES NO NO
title: Mulliken charges:
elementType: O O O O C C C C C C C C C C C C H H H H H H H H H H H H H H
charge: -0.405856 -0.236311 -0.423138 -0.216882 -0.143198 -0.615587 0.382959 -0.504527 0.281750 0.155486 -0.403882 -0.406027 -0.854779 0.178070 -0.253207 -0.237464 0.288996 0.227916 0.244832 0.262447 0.264535 0.258770 0.228084 0.229934 0.230301 0.248597 0.227180 0.225797 0.380350 0.384852
chargesum: 0.00000
title: Mulliken charges with hydrogens summed into heavy atoms:
elementType: O O O O C C C C C C C C C C C C
charge: -0.025506 -0.236311 -0.038285 -0.216882 0.145798 -0.142838 0.382959 0.022455 0.281750 0.155486 -0.145112 -0.177943 -0.145947 0.178070 -0.026027 -0.011668
polarizability: 1.64550496e+02 1.11472761e+01 1.40877828e+02 1.08215405e+01 -1.52396249e+01 1.04440475e+02
1716.lowfreq: -8.4224 -7.4125 -6.0887 -0.0007 -0.0006 -0.0001 8.0063 30.5195 34.8862
frequency: 6.2663 30.4890 34.8612 58.8991 68.9950 78.9252 127.3508 134.4912 154.0800 195.5511 239.4800 255.2392 299.5281 331.3236 400.2024 409.2610 447.2916 468.3419 510.6350 523.3052 545.6276 564.9536 595.3046 612.2350 629.6669 662.2852 714.0824 726.0329 746.2801 763.8317 793.7142 834.8136 845.2992 878.9574 881.8095 950.8054 972.1030 989.0941 991.0899 1018.1356 1043.8544 1048.7766 1054.3285 1066.8840 1085.0007 1114.7091 1170.7392 1177.0780 1190.6446 1208.8183 1231.4161 1242.7408 1278.4401 1298.8763 1300.3277 1311.6984 1326.0304 1365.0185 1378.5255 1404.7551 1433.1142 1443.1154 1466.7350 1474.2898 1482.1883 1490.1416 1587.9754 1614.6173 1657.7269 1668.9495 2969.3807 3000.7404 3001.3361 3047.5903 3055.3499 3072.0341 3083.1634 3093.0971 3116.4919 3126.1807 3139.6098 3159.4981 3502.4360 3515.3817
redmass: 6.8377 9.3983 5.7945 5.7896 4.5804 4.7417 4.1149 1.2032 3.4207 3.4455 6.6692 3.5769 3.8291 2.4839 3.2051 2.5048 3.1123 3.2562 3.6951 3.7853 3.8602 2.6405 3.6971 2.2180 1.5183 1.8948 4.0991 3.8568 2.0113 1.7504 3.0435 3.4719 4.3870 1.3542 2.2047 1.3983 2.1995 1.3402 1.5621 3.3800 1.6941 2.4336 2.5010 2.2276 1.9893 1.9962 1.1349 1.0857 2.1658 1.3372 1.8274 1.7269 1.5492 1.3519 2.1631 1.3311 1.3725 2.2049 3.6192 1.2438 1.9854 1.0822 1.1612 1.1150 1.4135 1.5604 6.4219 6.1493 8.3243 8.6795 1.0393 1.0596 1.0634 1.0945 1.0981 1.0909 1.0989 1.0958 1.0859 1.0885 1.0941 1.1008 1.0638 1.0641
irintensity: 2.1786 0.3312 0.7588 0.2221 0.1832 0.4997 0.3147 0.6379 0.2243 1.3741 0.8960 1.3909 2.4242 0.7067 0.1375 0.7476 1.9861 34.2700 15.1799 32.2867 6.4696 25.2234 35.8255 1.3046 186.0946 64.9046 47.7409 1.5794 29.8841 41.0998 7.6142 3.2529 30.3566 0.9432 6.2497 0.2467 10.8027 0.4426 2.0306 119.8557 9.4896 15.1382 50.6195 201.7347 46.0073 50.7892 4.4631 2.6368 1.8167 6.5992 0.8260 1.2680 9.9604 1.4198 42.7325 10.1483 3.7558 27.3308 7.0789 11.3862 1.5700 19.4537 18.1978 18.1872 11.9107 21.0889 0.3207 1.3542 189.0271 255.4220 25.3784 24.8991 10.8291 15.7097 8.3550 3.4265 21.4143 6.0481 7.0839 5.6246 29.3525 28.9888 24.1560 27.6360
temp: 298.150 k
press: 1.00000 atm
elementType: 8 8 8 8 6 6 6 6 6 6 6 6 6 6 6 6 1 1 1 1 1 1 1 1 1 1 1 1 1 1
symmnumber: 1
zpe: 622001.0 jmol-1
zpe.correction: 0.236908 hartree
zpe.thermalcorrener: 0.252971 hartree
zpe.thermalcorrenthalpy: 0.253915 hartree
zpe.thermalcorrgfe: 0.189608 hartree
zpe.sumelectzpe: -765.405574 hartree
zpe.sumelectthermal: -765.389511 hartree
zpe.sumelectthermalent: -765.388567 hartree
zpe.sumelectthermalfe: -765.452874 hartree
dipole: 0.2789 -0.7133 2.4104
dipole: 2.5291
quadrupole: -95.4215 -85.1702 -98.9124
quadrupole: 0.1140 -5.4878 0.4616
quadrupole: -2.2535 7.9978 -5.7444 0.1140 -5.4878 0.4616
hfenergy: -765.642482 hartree
pointgroup: C01 [X(C12H14O4)]
dipole: -0.117958 0.2877324 0.9451941 debye
polarizability: 163.9705388|11.6195031|141.7931152|-11.2850794|14.5641724|104.1051446 unknown
InChI: InChI=1S/C12H14O4/c1-8-4-2-3-5-9(8)6-10(12(15)16)7-11(13)14/h2-5,10,13,15H,6-7H2,1H3
charge 0 multiplicity 1
30 atoms
O  0.716863 -2.351246 1.79525
O  0.538924 -2.872447 -0.458787
O  2.820874 1.675983 0.878606
O  4.00348 1.313895 -1.08579
C  1.139863 -0.564006 0.222027
C  0.282984 0.06215 -0.919642
C  -1.188954 0.206251 -0.549715
C  2.663234 -0.523938 -0.115199
C  -1.667441 1.348753 0.164317
C  0.757773 -2.02458 0.434827
C  -2.099373 -0.822217 -0.904515
C  -3.041985 1.411982 0.506244
C  -0.746569 2.50202 0.533478
C  3.233053 0.879155 -0.204776
C  -3.466127 -0.744393 -0.557765
C  -3.939898 0.3790 0.15485
H  0.975338 -0.025979 1.169666
H  0.717111 1.048928 -1.165361
H  0.38882 -0.577255 -1.81542
H  3.227844 -1.055968 0.675672
H  2.864152 -1.029056 -1.074727
H  -1.724939 -1.691908 -1.457313
H  -3.413178 2.287775 1.052732
H  -0.387761 3.034403 -0.369592
H  -1.275098 3.238295 1.16281
H  0.151417 2.165957 1.08338
H  -4.152026 -1.549577 -0.843564
H  -4.997834 0.45467 0.430785
H  0.482129 -3.314298 1.897738
H  3.247327 2.57275 0.805581
