program: Gaussian 09
title: 000278038
version: EM64L-G09RevD.01
frameworkgroup: C1[X(C27H19NO4)]
method: RPBEPBE
basis: SDD
operation: Freq
keyword: #p
keyword: freq=noraman
keyword: PBEPBE/SDD
title: #p freq=noraman PBEPBE/SDD
converged: YES YES NO NO
title: Mulliken charges:
elementType: O O O O N C C C C C C C C C C C C C C C C C C C C C C C C C C C H H H H H H H H H H H H H H H H H H H
charge: -0.430658 -0.249373 -0.412847 -0.278517 -0.482674 -0.331511 0.229777 0.188691 0.200847 0.186319 -0.541930 -0.387096 0.516259 -0.402936 -0.397783 -0.484135 -0.236693 -0.230643 0.012097 0.138374 0.194983 0.221519 -0.376827 -0.366059 0.128742 -0.361374 -0.236065 -0.226709 -0.345363 -0.215480 -0.227489 0.087993 0.250352 0.332283 0.237748 0.258326 0.237232 0.240127 0.226764 0.224629 0.339091 0.382800 0.269192 0.248401 0.264041 0.235002 0.232977 0.269196 0.240083 0.240040 0.388275
chargesum: 0.00000
title: Mulliken charges with hydrogens summed into heavy atoms:
elementType: O O O O N C C C C C C C C C C C C C C C C C C C C C C C C C C C
charge: -0.091566 -0.249373 -0.024572 -0.278517 -0.099875 -0.081159 0.229777 0.188691 0.200847 0.186319 -0.209647 -0.149348 0.516259 -0.144610 -0.160552 -0.244008 -0.009928 -0.006014 0.012097 0.138374 0.194983 0.221519 -0.107635 -0.117658 0.128742 -0.097332 -0.001063 0.006269 -0.076168 0.024603 0.012551 0.087993
polarizability: 4.74427377e+02 -4.13283563e+01 3.07372787e+02 -2.08137857e+01 -1.60294820e+01 2.38197478e+02
1716.lowfreq: -2.9664 -2.1915 -0.0004 0.0002 0.0006 5.3209 15.9029 19.9493 34.0616
frequency: 15.8803 19.9440 34.0483 46.0296 52.1645 65.7586 74.0897 95.8034 102.0715 104.6720 116.8648 130.1499 137.7829 151.5143 160.3192 186.5594 202.0089 236.1593 261.6565 280.8374 296.1716 324.4608 333.7193 351.1547 357.7664 376.2722 383.3800 395.4569 398.2940 406.3689 443.6245 463.5605 500.2119 519.7470 524.9672 541.2287 550.3350 562.4346 585.1577 600.0313 601.5354 610.3431 611.6164 616.8286 656.8309 666.5796 690.1579 704.5062 718.7877 720.0967 733.9797 748.8650 763.7740 766.5494 772.2324 778.9102 782.1622 789.2347 802.6597 824.6040 829.4983 858.7803 877.5051 882.0853 885.8383 894.3538 935.0658 949.1249 950.9603 956.5402 960.5171 970.0261 974.0196 985.6789 993.4625 994.4545 994.8562 1001.2297 1020.3126 1024.8157 1038.0644 1046.8517 1084.7398 1097.1024 1111.8438 1117.9741 1127.6839 1159.2843 1164.4452 1166.9258 1175.1804 1178.9003 1183.7452 1195.4651 1204.5623 1220.2725 1241.6941 1258.8540 1273.7114 1283.8660 1287.6202 1291.2546 1307.3082 1330.7630 1354.7520 1362.5266 1369.1233 1372.6633 1387.7733 1421.0012 1432.3744 1442.8462 1453.8037 1458.3799 1462.9191 1490.1231 1490.6339 1536.2943 1569.8431 1575.6807 1590.5045 1594.3880 1594.9214 1603.6734 1611.8838 1617.6000 1621.2526 1628.1040 3023.8959 3121.8962 3123.1627 3126.7071 3132.9337 3137.3165 3139.5210 3144.7634 3146.1394 3150.5396 3152.4812 3161.7004 3162.6282 3168.0221 3176.0437 3185.8625 3310.9844 3514.3855 3547.5512
redmass: 6.1429 5.4992 6.6804 5.9183 6.5957 7.0798 5.0925 8.3758 5.6377 6.2326 4.9528 5.1948 3.9575 5.9861 5.3082 6.0145 4.4748 5.7551 5.5431 5.9748 4.7611 6.2576 2.2146 2.0753 4.8123 3.9698 6.1122 4.7724 3.4795 5.7960 3.1099 3.8624 4.7299 4.9840 4.8355 4.2091 4.2240 3.7262 4.1654 3.0526 4.0409 1.8350 4.9579 4.6833 6.2338 4.5026 4.6312 4.2251 5.3037 5.3388 4.5184 1.7957 1.8915 2.8491 2.1212 4.8562 2.1172 2.2231 3.5148 2.4676 1.7753 6.2749 1.2152 1.4492 1.4305 1.4348 3.1147 1.5322 1.4262 1.3792 1.4212 1.4034 4.8601 1.3235 6.9994 1.5489 3.8460 1.3538 5.0827 2.1239 2.5759 2.3163 2.6060 1.9699 1.8760 1.6480 2.0999 1.5334 1.7446 1.1937 1.0589 1.0655 1.6814 1.5920 1.3429 1.7156 2.1883 1.9038 1.8516 1.8598 1.6749 1.7328 2.6628 2.9113 1.1910 8.3179 6.1313 9.7158 4.2652 2.0686 2.3371 2.7441 3.1235 3.5164 2.5581 4.0764 3.1418 2.7595 6.5384 6.9080 8.2854 6.7825 6.6677 6.0743 6.3353 7.0307 3.4707 3.9824 1.0833 1.0861 1.0867 1.0864 1.0894 1.0862 1.0894 1.0952 1.0963 1.0905 1.0944 1.1003 1.0954 1.1006 1.0998 1.0934 1.0822 1.0641 1.0662
irintensity: 0.3932 0.4190 0.1229 0.6255 2.0091 2.4161 1.2323 3.1192 2.7759 3.3719 1.2544 0.2286 0.1407 0.0533 0.8615 0.9363 0.2259 0.9882 0.6814 1.1245 0.7748 7.7349 85.4059 39.9502 2.3499 1.4573 8.6360 5.2763 5.3410 6.2698 1.7842 14.3493 3.8920 5.1266 0.2831 5.4045 17.7852 8.5461 8.0933 31.2121 14.4659 64.5789 7.4686 14.3480 6.8724 6.9699 46.2090 30.0777 11.6140 1.6764 9.4190 57.2550 42.6936 42.4969 56.7493 14.1865 16.7588 20.4705 7.8130 11.1269 9.3029 19.9407 135.0693 14.9885 1.7810 2.9055 10.7739 9.5613 4.1359 1.0626 0.7456 8.5539 53.5081 0.0059 16.7496 0.6969 7.4809 1.1421 183.8669 3.0784 12.3468 31.9543 35.3238 3.4128 10.0609 39.6951 17.7442 8.5469 85.2121 7.4512 0.8560 0.2860 12.1942 7.4929 19.1607 0.1621 20.0108 18.7098 23.1218 57.1714 12.4816 20.0198 82.9741 120.4442 31.5454 3.2158 68.4037 9.1767 33.0441 7.3359 3.2426 28.3123 62.2811 114.5410 33.4162 150.6998 29.1730 302.2339 16.3471 21.8692 82.8440 11.6603 104.3565 16.9646 276.4430 31.1836 38.1274 7.1073 8.5940 13.4465 3.8796 1.3710 2.9767 1.3929 7.0401 7.3825 31.5550 6.8994 15.1571 46.3924 7.8050 31.5846 14.0483 5.8287 323.9837 51.3705 8.1979
temp: 298.150 k
press: 1.00000 atm
elementType: 8 8 8 8 7 6 6 6 6 6 6 6 6 6 6 6 6 6 6 6 6 6 6 6 6 6 6 6 6 6 6 6 1 1 1 1 1 1 1 1 1 1 1 1 1 1 1 1 1 1 1
symmnumber: 1
zpe: 1016262.1 jmol-1
zpe.correction: 0.387074 hartree
zpe.thermalcorrener: 0.413131 hartree
zpe.thermalcorrenthalpy: 0.414075 hartree
zpe.thermalcorrgfe: 0.329050 hartree
zpe.sumelectzpe: -1393.788849 hartree
zpe.sumelectthermal: -1393.762792 hartree
zpe.sumelectthermalent: -1393.761848 hartree
zpe.sumelectthermalfe: -1393.846873 hartree
dipole: 3.5158 5.2690 -1.5780
dipole: 6.5279
quadrupole: -160.1308 -177.6477 -172.2452
quadrupole: -4.1337 2.1477 3.3485
quadrupole: 9.8771 -7.6398 -2.2373 -4.1337 2.1477 3.3485
hfenergy: -1394.175923 hartree
pointgroup: C01 [X(C27H19N1O4)]
dipole: -1.2813542 1.744015 1.3829362 debye
polarizability: 475.9351495|42.7227325|285.3679006|-12.9500848|33.4358842|258.6945927 unknown
InChI: InChI=1S/C27H19NO4/c29-25-21-10-4-1-7-17(21)20-14-13-16(15-24(20)25)28-26(30)22-11-5-2-8-18(22)19-9-3-6-12-23(19)27(31)32/h1-15,25,28-29,31H
charge 0 multiplicity 1
51 atoms
O  4.142033 -2.383323 -1.883369
O  -0.980797 -2.235543 -1.617936
O  -3.390437 2.52826 2.82645
O  -2.455835 0.457394 2.389518
N  -0.789794 -0.842841 0.280936
C  4.010669 -0.957127 -1.528427
C  2.856546 -0.632351 -0.573783
C  3.339657 0.119378 0.537515
C  5.220549 -0.365924 -0.798389
C  4.802474 0.285554 0.400854
C  1.506474 -0.980707 -0.708536
C  2.438902 0.542776 1.53784
C  0.59996 -0.555285 0.308298
C  6.572905 -0.396988 -1.170736
C  5.748424 0.924622 1.230737
C  1.075916 0.204228 1.417916
C  7.526213 0.23759 -0.331529
C  7.113643 0.895134 0.853939
C  -1.498756 -1.602868 -0.64525
C  -2.979617 -1.669187 -0.344338
C  -3.772931 -0.504763 -0.141107
C  -3.29177 0.885237 -0.464889
C  -3.569656 -2.95308 -0.245484
C  -5.136822 -0.661681 0.2213
C  -3.09069 1.898805 0.521331
C  -3.199443 1.256109 -1.82987
C  -4.92693 -3.09602 0.109471
C  -5.70817 -1.944562 0.361749
C  -2.871609 3.248648 0.138116
C  -2.938937 2.591401 -2.20924
C  -2.795811 3.596504 -1.224553
C  -2.959781 1.530214 1.953123
H  3.862211 -0.479067 -2.51433
H  1.142109 -1.571843 -1.550803
H  2.781957 1.122289 2.401994
H  6.885914 -0.909334 -2.087092
H  5.44171 1.432905 2.152036
H  0.364444 0.51652 2.1920
H  8.588068 0.221041 -0.601499
H  7.861838 1.383938 1.488466
H  4.230515 -2.904717 -1.044255
H  -1.344933 -0.470626 1.071546
H  -2.945091 -3.83041 -0.442385
H  -5.755404 0.231788 0.364345
H  -3.351713 0.48759 -2.594808
H  -5.370266 -4.094005 0.193007
H  -6.762123 -2.043367 0.643855
H  -2.737702 4.005391 0.916693
H  -2.865199 2.848222 -3.271487
H  -2.613928 4.63587 -1.516347
H  -3.215889 2.241109 3.763908
